﻿2026-07-10T09:14:09.7330360Z ##[group]Run cargo nextest run --workspace --no-fail-fast -E 'not ( (package(spt-daemon) & kind(test) & binary(/^(attach|brain_swap|broker|budget|daemon_e2e|daemon_lifecycle_real_brain|digest|dispatch|driven_by_selfheal|handoff|idempotent|inject_control_wedge|input_ack_deadlock|resume|shellchan|two_origin_spanning|twohost)$/)) | (package(spt) & kind(test) & binary(/^(attach_wedge_e2e|bind_cwd_project_e2e|brain_respawn_rename|brain_split|brain_survive|dummy_harness_e2e|gateway_owner_shell_e2e|job_escape_e2e|livehost_bootgate_e2e|n1_pairing|oneliner_e2e|resume_template_e2e)$/)) | (package(spt-term) & kind(test)) )'
2026-07-10T09:14:09.7333214Z [36;1mcargo nextest run --workspace --no-fail-fast -E 'not ( (package(spt-daemon) & kind(test) & binary(/^(attach|brain_swap|broker|budget|daemon_e2e|daemon_lifecycle_real_brain|digest|dispatch|driven_by_selfheal|handoff|idempotent|inject_control_wedge|input_ack_deadlock|resume|shellchan|two_origin_spanning|twohost)$/)) | (package(spt) & kind(test) & binary(/^(attach_wedge_e2e|bind_cwd_project_e2e|brain_respawn_rename|brain_split|brain_survive|dummy_harness_e2e|gateway_owner_shell_e2e|job_escape_e2e|livehost_bootgate_e2e|n1_pairing|oneliner_e2e|resume_template_e2e)$/)) | (package(spt-term) & kind(test)) )'[0m
2026-07-10T09:14:09.7401453Z shell: C:\Program Files\PowerShell\7\pwsh.EXE -command ". '{0}'"
2026-07-10T09:14:09.7401752Z env:
2026-07-10T09:14:09.7401928Z   SPT_ATTACH_GATE_WATCHDOG_MS: 120000
2026-07-10T09:14:09.7402142Z   SPT_ATTACH_IPC_DEADLINE_MS: 30000
2026-07-10T09:14:09.7402343Z ##[endgroup]
2026-07-10T09:14:11.9450983Z    Compiling proc-macro2 v1.0.106
2026-07-10T09:14:11.9451473Z    Compiling unicode-ident v1.0.24
2026-07-10T09:14:11.9451817Z    Compiling quote v1.0.45
2026-07-10T09:14:11.9452126Z    Compiling cfg-if v1.0.4
2026-07-10T09:14:11.9452417Z    Compiling serde_core v1.0.228
2026-07-10T09:14:11.9452707Z    Compiling serde v1.0.228
2026-07-10T09:14:11.9453004Z    Compiling windows-link v0.2.1
2026-07-10T09:14:11.9453292Z    Compiling typenum v1.20.1
2026-07-10T09:14:11.9453626Z    Compiling version_check v0.9.5
2026-07-10T09:14:11.9453934Z    Compiling portable-atomic v1.13.1
2026-07-10T09:14:11.9454299Z    Compiling getrandom v0.3.4
2026-07-10T09:14:11.9454653Z    Compiling critical-section v1.2.0
2026-07-10T09:14:11.9455049Z    Compiling find-msvc-tools v0.1.9
2026-07-10T09:14:11.9455365Z    Compiling subtle v2.6.1
2026-07-10T09:14:11.9456229Z    Compiling memchr v2.8.1
2026-07-10T09:14:11.9456582Z    Compiling shlex v2.0.1
2026-07-10T09:14:12.0235249Z    Compiling equivalent v1.0.2
2026-07-10T09:14:12.0955739Z    Compiling windows-sys v0.61.2
2026-07-10T09:14:12.1213683Z    Compiling smallvec v1.15.1
2026-07-10T09:14:12.1772466Z    Compiling semver v1.0.28
2026-07-10T09:14:12.1998355Z    Compiling itoa v1.0.18
2026-07-10T09:14:12.3163083Z    Compiling getrandom v0.2.17
2026-07-10T09:14:12.3367006Z    Compiling cpufeatures v0.2.17
2026-07-10T09:14:12.4074167Z    Compiling rustc_version v0.4.1
2026-07-10T09:14:12.4340139Z    Compiling rand_core v0.10.1
2026-07-10T09:14:12.4566028Z    Compiling hashbrown v0.17.1
2026-07-10T09:14:12.4857831Z    Compiling generic-array v0.14.7
2026-07-10T09:14:12.4858297Z    Compiling getrandom v0.4.2
2026-07-10T09:14:12.5646434Z    Compiling pin-project-lite v0.2.17
2026-07-10T09:14:12.5977020Z    Compiling log v0.4.32
2026-07-10T09:14:12.6564721Z    Compiling winapi v0.3.9
2026-07-10T09:14:12.7495941Z    Compiling bitflags v2.12.1
2026-07-10T09:14:12.7640178Z    Compiling futures-core v0.3.32
2026-07-10T09:14:12.7787530Z    Compiling curve25519-dalek v4.1.3
2026-07-10T09:14:12.9584385Z    Compiling bytes v1.11.1
2026-07-10T09:14:13.0310452Z    Compiling indexmap v2.14.0
2026-07-10T09:14:13.0661976Z    Compiling rand_core v0.6.4
2026-07-10T09:14:13.0837316Z    Compiling zerocopy v0.8.50
2026-07-10T09:14:13.0960936Z    Compiling ahash v0.8.12
2026-07-10T09:14:13.5386060Z    Compiling libc v0.2.186
2026-07-10T09:14:13.6295529Z    Compiling signature v2.2.0
2026-07-10T09:14:13.7063000Z    Compiling stable_deref_trait v1.2.1
2026-07-10T09:14:13.7519829Z    Compiling jobserver v0.1.34
2026-07-10T09:14:13.8892850Z    Compiling uuid v1.23.2
2026-07-10T09:14:13.8893286Z    Compiling ed25519 v2.2.3
2026-07-10T09:14:13.9868025Z    Compiling cc v1.2.63
2026-07-10T09:14:14.0008659Z    Compiling zmij v1.0.21
2026-07-10T09:14:14.2218841Z    Compiling vcpkg v0.2.15
2026-07-10T09:14:14.2592012Z    Compiling pkg-config v0.3.33
2026-07-10T09:14:14.3835893Z    Compiling syn v2.0.117
2026-07-10T09:14:14.4483423Z    Compiling crypto-common v0.1.7
2026-07-10T09:14:14.4649123Z    Compiling block-buffer v0.10.4
2026-07-10T09:14:14.5113177Z    Compiling serde_json v1.0.150
2026-07-10T09:14:14.5459057Z    Compiling autocfg v1.5.1
2026-07-10T09:14:14.5497444Z    Compiling fastrand v2.4.1
2026-07-10T09:14:14.5823438Z    Compiling digest v0.10.7
2026-07-10T09:14:14.6192417Z    Compiling futures-io v0.3.32
2026-07-10T09:14:14.6554038Z    Compiling futures-sink v0.3.32
2026-07-10T09:14:14.7717093Z    Compiling slab v0.4.12
2026-07-10T09:14:14.8344043Z    Compiling sha2 v0.10.9
2026-07-10T09:14:14.8566352Z    Compiling futures-task v0.3.32
2026-07-10T09:14:14.9487874Z    Compiling fallible-streaming-iterator v0.1.9
2026-07-10T09:14:15.0381094Z    Compiling windows_x86_64_msvc v0.52.6
2026-07-10T09:14:15.1087048Z    Compiling fallible-iterator v0.3.0
2026-07-10T09:14:15.1540088Z    Compiling futures-channel v0.3.32
2026-07-10T09:14:15.1593173Z    Compiling rustversion v1.0.22
2026-07-10T09:14:15.2733165Z    Compiling fnv v1.0.7
2026-07-10T09:14:15.2733742Z    Compiling cfg_aliases v0.2.1
2026-07-10T09:14:15.3023463Z    Compiling strsim v0.11.1
2026-07-10T09:14:15.3268502Z    Compiling writeable v0.6.3
2026-07-10T09:14:15.4046367Z    Compiling litemap v0.8.2
2026-07-10T09:14:15.4373489Z    Compiling cmake v0.1.58
2026-07-10T09:14:15.4520134Z    Compiling dunce v1.0.5
2026-07-10T09:14:15.4610032Z    Compiling anyhow v1.0.102
2026-07-10T09:14:15.5928706Z    Compiling utf8_iter v1.0.4
2026-07-10T09:14:15.5973406Z    Compiling ident_case v1.0.1
2026-07-10T09:14:15.6030286Z    Compiling icu_normalizer_data v2.2.0
2026-07-10T09:14:15.6752182Z    Compiling fs_extra v1.3.0
2026-07-10T09:14:15.6979508Z    Compiling icu_properties_data v2.2.0
2026-07-10T09:14:15.7392433Z    Compiling windows-targets v0.52.6
2026-07-10T09:14:15.7480428Z    Compiling percent-encoding v2.3.2
2026-07-10T09:14:15.7722686Z    Compiling http v1.4.1
2026-07-10T09:14:15.8853050Z    Compiling thiserror v2.0.18
2026-07-10T09:14:15.9264313Z    Compiling windows-sys v0.59.0
2026-07-10T09:14:15.9416197Z    Compiling libsqlite3-sys v0.30.1
2026-07-10T09:14:15.9484931Z    Compiling ring v0.17.14
2026-07-10T09:14:16.1324001Z    Compiling fs2 v0.4.3
2026-07-10T09:14:16.1366548Z    Compiling aws-lc-sys v0.41.0
2026-07-10T09:14:16.1793054Z    Compiling aws-lc-rs v1.17.0
2026-07-10T09:14:16.3368369Z    Compiling unicode-segmentation v1.13.3
2026-07-10T09:14:16.7878669Z    Compiling cpufeatures v0.3.0
2026-07-10T09:14:16.8047152Z    Compiling scopeguard v1.2.0
2026-07-10T09:14:16.8659941Z    Compiling form_urlencoded v1.2.2
2026-07-10T09:14:16.9602523Z    Compiling chacha20 v0.10.0
2026-07-10T09:14:17.0467439Z    Compiling untrusted v0.9.0
2026-07-10T09:14:17.1117502Z    Compiling lock_api v0.4.14
2026-07-10T09:14:17.2341521Z    Compiling num-traits v0.2.19
2026-07-10T09:14:17.4309019Z    Compiling windows-strings v0.5.1
2026-07-10T09:14:17.4676039Z    Compiling windows-result v0.4.1
2026-07-10T09:14:17.5287797Z    Compiling rand v0.10.1
2026-07-10T09:14:17.5531870Z    Compiling rustls v0.23.40
2026-07-10T09:14:17.7663623Z    Compiling heck v0.5.0
2026-07-10T09:14:17.7828510Z    Compiling convert_case v0.10.0
2026-07-10T09:14:17.9104361Z    Compiling synstructure v0.13.2
2026-07-10T09:14:17.9960095Z    Compiling darling_core v0.20.11
2026-07-10T09:14:18.6567791Z    Compiling atomic-waker v1.1.2
2026-07-10T09:14:18.6680796Z    Compiling arrayvec v0.7.6
2026-07-10T09:14:18.7092152Z    Compiling unicode-xid v0.2.6
2026-07-10T09:14:18.7846064Z    Compiling const-oid v0.10.2
2026-07-10T09:14:18.8231988Z    Compiling httparse v1.10.1
2026-07-10T09:14:18.8648221Z    Compiling parking_lot_core v0.9.12
2026-07-10T09:14:18.8865793Z    Compiling http-body v1.0.1
2026-07-10T09:14:18.9550960Z    Compiling hybrid-array v0.4.12
2026-07-10T09:14:18.9614541Z    Compiling powerfmt v0.2.0
2026-07-10T09:14:19.0598146Z    Compiling utf8parse v0.2.2
2026-07-10T09:14:19.1198547Z    Compiling socket2 v0.6.4
2026-07-10T09:14:19.1281009Z    Compiling mio v1.2.1
2026-07-10T09:14:19.2293228Z    Compiling base64ct v1.8.3
2026-07-10T09:14:19.2327956Z    Compiling either v1.16.0
2026-07-10T09:14:19.4055555Z    Compiling deranged v0.5.8
2026-07-10T09:14:19.4336291Z    Compiling memoffset v0.6.5
2026-07-10T09:14:19.5407567Z    Compiling pem-rfc7468 v1.0.0
2026-07-10T09:14:19.6076219Z    Compiling tower-service v0.3.3
2026-07-10T09:14:19.6083907Z    Compiling ref-cast v1.0.25
2026-07-10T09:14:19.6484069Z    Compiling time-core v0.1.8
2026-07-10T09:14:19.7588675Z    Compiling data-encoding v2.11.0
2026-07-10T09:14:19.7805779Z    Compiling try-lock v0.2.5
2026-07-10T09:14:19.7838752Z    Compiling num-conv v0.2.2
2026-07-10T09:14:19.8253173Z    Compiling base64 v0.22.1
2026-07-10T09:14:19.8777187Z    Compiling tinyvec_macros v0.1.1
2026-07-10T09:14:19.9269546Z    Compiling serde_derive v1.0.228
2026-07-10T09:14:19.9388386Z    Compiling zeroize_derive v1.4.3
2026-07-10T09:14:19.9894130Z    Compiling curve25519-dalek-derive v0.1.1
2026-07-10T09:14:20.0090553Z    Compiling zerofrom-derive v0.1.7
2026-07-10T09:14:20.0584087Z    Compiling tokio-macros v2.7.0
2026-07-10T09:14:20.0642298Z    Compiling yoke-derive v0.8.2
2026-07-10T09:14:20.1751040Z    Compiling futures-macro v0.3.32
2026-07-10T09:14:20.3333730Z    Compiling zerovec-derive v0.11.3
2026-07-10T09:14:20.3507217Z    Compiling displaydoc v0.2.6
2026-07-10T09:14:20.3773769Z    Compiling tracing-attributes v0.1.31
2026-07-10T09:14:20.7364911Z    Compiling thiserror-impl v2.0.18
2026-07-10T09:14:20.8337610Z    Compiling zeroize v1.8.2
2026-07-10T09:14:20.8525554Z    Compiling derive_more-impl v2.1.1
2026-07-10T09:14:20.9824491Z    Compiling tokio v1.52.3
2026-07-10T09:14:21.2638446Z    Compiling windows-interface v0.59.3
2026-07-10T09:14:21.5172342Z    Compiling rustls-pki-types v1.14.1
2026-07-10T09:14:21.5433190Z    Compiling futures-util v0.3.32
2026-07-10T09:14:21.5648080Z    Compiling windows-implement v0.60.2
2026-07-10T09:14:21.6596764Z    Compiling n0-error-macros v0.1.3
2026-07-10T09:14:21.7363550Z    Compiling zerofrom v0.1.8
2026-07-10T09:14:21.9266291Z    Compiling darling_macro v0.20.11
2026-07-10T09:14:21.9782739Z    Compiling spez v0.1.2
2026-07-10T09:14:22.1303279Z    Compiling yoke v0.8.3
2026-07-10T09:14:22.3703171Z    Compiling thiserror v1.0.69
2026-07-10T09:14:22.5074349Z    Compiling der v0.8.0-rc.10
2026-07-10T09:14:22.5074870Z    Compiling darling v0.20.11
2026-07-10T09:14:22.5750836Z    Compiling ed25519-dalek v2.2.0
2026-07-10T09:14:22.6757467Z    Compiling zerovec v0.11.6
2026-07-10T09:14:22.6893523Z    Compiling zerotrie v0.2.4
2026-07-10T09:14:22.7539118Z    Compiling derive_builder_core v0.20.2
2026-07-10T09:14:22.7863896Z    Compiling n0-error v0.1.3
2026-07-10T09:14:22.8569101Z    Compiling windows-core v0.62.2
2026-07-10T09:14:23.1765774Z    Compiling spt-proto v0.30.6 (C:\actions-runner\_work\spt-core\spt-core\crates\spt-proto)
2026-07-10T09:14:23.2120031Z    Compiling want v0.3.1
2026-07-10T09:14:23.4668186Z    Compiling tinystr v0.8.3
2026-07-10T09:14:23.4902586Z    Compiling potential_utf v0.1.5
2026-07-10T09:14:23.5091915Z    Compiling tinyvec v1.11.0
2026-07-10T09:14:23.5116573Z    Compiling thiserror-impl v1.0.69
2026-07-10T09:14:23.5584153Z    Compiling pin-project-internal v1.1.13
2026-07-10T09:14:23.7060320Z    Compiling icu_locale_core v2.2.0
2026-07-10T09:14:23.7714492Z    Compiling icu_collections v2.2.0
2026-07-10T09:14:23.8011704Z    Compiling ref-cast-impl v1.0.25
2026-07-10T09:14:24.0515146Z    Compiling parking_lot v0.12.5
2026-07-10T09:14:24.1362601Z    Compiling derive_builder_macro v0.20.2
2026-07-10T09:14:24.6083115Z    Compiling ipnet v2.12.0
2026-07-10T09:14:24.6214721Z    Compiling serde_spanned v0.6.9
2026-07-10T09:14:24.6359865Z    Compiling toml_datetime v0.6.11
2026-07-10T09:14:24.7480650Z    Compiling icu_provider v2.2.0
2026-07-10T09:14:24.7970336Z    Compiling block-buffer v0.12.0
2026-07-10T09:14:25.1779821Z    Compiling tokio-util v0.7.18
2026-07-10T09:14:25.2014138Z    Compiling crypto-common v0.2.2
2026-07-10T09:14:25.2243078Z    Compiling serde_derive_internals v0.29.1
2026-07-10T09:14:25.2296566Z    Compiling vergen-lib v9.1.0
2026-07-10T09:14:25.2933915Z    Compiling n0-future v0.3.2
2026-07-10T09:14:25.3447271Z    Compiling serial-core v0.4.0
2026-07-10T09:14:25.3449323Z    Compiling inout v0.1.4
2026-07-10T09:14:25.3547435Z    Compiling icu_normalizer v2.2.0
2026-07-10T09:14:25.3785530Z    Compiling icu_properties v2.2.0
2026-07-10T09:14:25.4371159Z    Compiling derive_more v2.1.1
2026-07-10T09:14:25.5884992Z    Compiling derive_builder v0.20.2
2026-07-10T09:14:25.5935502Z    Compiling aho-corasick v1.1.4
2026-07-10T09:14:25.6015232Z    Compiling winnow v1.0.3
2026-07-10T09:14:25.6125173Z    Compiling cordyceps v0.3.4
2026-07-10T09:14:25.7149896Z    Compiling once_cell v1.21.4
2026-07-10T09:14:25.8207870Z    Compiling winreg v0.10.1
2026-07-10T09:14:25.9439088Z    Compiling tracing-core v0.1.36
2026-07-10T09:14:25.9564770Z    Compiling tempfile v3.27.0
2026-07-10T09:14:26.0422096Z    Compiling spin v0.10.0
2026-07-10T09:14:26.0755082Z    Compiling toml_write v0.1.2
2026-07-10T09:14:26.0902349Z    Compiling regex-syntax v0.8.10
2026-07-10T09:14:26.2561684Z    Compiling hashbrown v0.14.5
2026-07-10T09:14:26.2941885Z    Compiling parking v2.2.1
2026-07-10T09:14:26.3333575Z    Compiling diatomic-waker v0.2.3
2026-07-10T09:14:26.3368421Z    Compiling httpdate v1.0.3
2026-07-10T09:14:26.3738404Z    Compiling tracing v0.1.44
2026-07-10T09:14:26.6198006Z    Compiling winnow v0.7.15
2026-07-10T09:14:26.6725759Z    Compiling crossbeam-utils v0.8.21
2026-07-10T09:14:26.8019821Z    Compiling idna_adapter v1.2.2
2026-07-10T09:14:26.8323847Z    Compiling h2 v0.4.14
2026-07-10T09:14:26.8744069Z    Compiling toml_parser v1.1.2+spec-1.1.0
2026-07-10T09:14:26.9965108Z    Compiling idna v1.1.0
2026-07-10T09:14:26.9974328Z    Compiling schemars_derive v1.2.1
2026-07-10T09:14:27.0275762Z    Compiling futures-buffered v0.2.13
2026-07-10T09:14:27.0977932Z    Compiling hashlink v0.9.1
2026-07-10T09:14:27.1477624Z    Compiling futures-lite v2.6.1
2026-07-10T09:14:27.2947500Z    Compiling digest v0.11.3
2026-07-10T09:14:27.4487077Z    Compiling rusqlite v0.32.1
2026-07-10T09:14:27.4817642Z    Compiling url v2.5.8
2026-07-10T09:14:27.5167054Z    Compiling cipher v0.4.4
2026-07-10T09:14:27.5287478Z    Compiling serial-windows v0.4.0
2026-07-10T09:14:27.6238637Z    Compiling pin-project v1.1.13
2026-07-10T09:14:27.9318191Z    Compiling spki v0.8.0-rc.4
2026-07-10T09:14:27.9860626Z    Compiling vergen v9.1.0
2026-07-10T09:14:28.0052628Z    Compiling vergen-lib v0.1.6
2026-07-10T09:14:28.0594634Z    Compiling noq-udp v0.10.0
2026-07-10T09:14:28.1510908Z    Compiling universal-hash v0.5.1
2026-07-10T09:14:28.1775802Z    Compiling regex-automata v0.4.14
2026-07-10T09:14:28.3165589Z    Compiling sync_wrapper v1.0.2
2026-07-10T09:14:28.3352785Z    Compiling heapless v0.7.17
2026-07-10T09:14:28.3394493Z    Compiling curve25519-dalek v5.0.0-pre.6
2026-07-10T09:14:28.4768636Z    Compiling spt-store v0.30.6 (C:\actions-runner\_work\spt-core\spt-core\crates\spt-store)
2026-07-10T09:14:28.4842331Z    Compiling pin-utils v0.1.0
2026-07-10T09:14:28.4989315Z    Compiling byteorder v1.5.0
2026-07-10T09:14:28.6344471Z    Compiling toml_edit v0.22.27
2026-07-10T09:14:28.7304853Z    Compiling bitflags v1.3.2
2026-07-10T09:14:28.7468833Z    Compiling lazy_static v1.5.0
2026-07-10T09:14:28.7527948Z    Compiling toml_datetime v1.1.1+spec-1.1.0
2026-07-10T09:14:28.7529793Z    Compiling dyn-clone v1.0.20
2026-07-10T09:14:28.8486507Z    Compiling allocator-api2 v0.2.21
2026-07-10T09:14:28.8548152Z    Compiling opaque-debug v0.3.1
2026-07-10T09:14:28.8837201Z    Compiling shared_library v0.1.9
2026-07-10T09:14:29.0109188Z    Compiling polyval v0.6.2
2026-07-10T09:14:29.0586898Z    Compiling toml_edit v0.25.12+spec-1.1.0
2026-07-10T09:14:29.1374839Z    Compiling nix v0.25.1
2026-07-10T09:14:29.2112520Z    Compiling schemars v1.2.1
2026-07-10T09:14:29.3630881Z    Compiling hash32 v0.2.1
2026-07-10T09:14:29.4723307Z    Compiling pkcs8 v0.11.0-rc.10
2026-07-10T09:14:29.5040840Z    Compiling filedescriptor v0.8.3
2026-07-10T09:14:30.0193857Z    Compiling serial v0.4.0
2026-07-10T09:14:30.1540746Z    Compiling prefix-trie v0.8.4
2026-07-10T09:14:30.1561073Z    Compiling futures-executor v0.3.32
2026-07-10T09:14:30.2526739Z    Compiling spin v0.9.8
2026-07-10T09:14:30.2968168Z    Compiling vergen-gitcl v1.0.8
2026-07-10T09:14:30.3857164Z    Compiling regex v1.12.3
2026-07-10T09:14:30.5467195Z    Compiling toml v0.8.23
2026-07-10T09:14:30.6279720Z    Compiling vte_generate_state_changes v0.1.2
2026-07-10T09:14:30.6333997Z    Compiling windows-threading v0.2.1
2026-07-10T09:14:30.6416529Z    Compiling signature v3.0.0
2026-07-10T09:14:30.6726167Z    Compiling ryu v1.0.23
2026-07-10T09:14:30.6792086Z    Compiling downcast-rs v1.2.1
2026-07-10T09:14:30.6832892Z    Compiling shell-words v1.1.1
2026-07-10T09:14:30.8235566Z    Compiling spt-msg v0.30.6 (C:\actions-runner\_work\spt-core\spt-core\crates\spt-msg)
2026-07-10T09:14:30.8323593Z    Compiling hyper v1.10.1
2026-07-10T09:14:30.8735198Z    Compiling tower-layer v0.3.3
2026-07-10T09:14:30.8913429Z    Compiling portable-pty v0.8.1
2026-07-10T09:14:31.0312455Z    Compiling ed25519 v3.0.0-rc.4
2026-07-10T09:14:31.0435623Z    Compiling hickory-proto v0.26.0-beta.4
2026-07-10T09:14:31.1458940Z    Compiling windows-future v0.3.2
2026-07-10T09:14:31.1599773Z    Compiling vte v0.13.1
2026-07-10T09:14:31.5752223Z    Compiling futures v0.3.32
2026-07-10T09:14:31.8031268Z    Compiling data-encoding-macro-internal v0.1.18
2026-07-10T09:14:31.8604172Z    Compiling proc-macro-crate v3.5.0
2026-07-10T09:14:32.1054767Z    Compiling ghash v0.5.1
2026-07-10T09:14:32.2054451Z    Compiling hyper-util v0.1.20
2026-07-10T09:14:32.2433311Z    Compiling ctr v0.9.2
2026-07-10T09:14:32.3452632Z    Compiling aes v0.8.4
2026-07-10T09:14:32.5094985Z    Compiling sha2 v0.11.0-rc.5
2026-07-10T09:14:32.5296786Z    Compiling windows-numerics v0.3.1
2026-07-10T09:14:32.5884953Z    Compiling windows-collections v0.3.2
2026-07-10T09:14:32.8914481Z    Compiling cobs v0.3.0
2026-07-10T09:14:32.9199513Z    Compiling time v0.3.47
2026-07-10T09:14:32.9200025Z    Compiling postcard-derive v0.2.2
2026-07-10T09:14:32.9686573Z    Compiling http-body-util v0.1.3
2026-07-10T09:14:33.2124351Z    Compiling aead v0.5.2
2026-07-10T09:14:33.2444804Z    Compiling widestring v1.2.1
2026-07-10T09:14:33.2773290Z    Compiling ipconfig v0.3.4
2026-07-10T09:14:33.3344759Z    Compiling windows v0.62.2
2026-07-10T09:14:33.3636522Z    Compiling ed25519-dalek v3.0.0-pre.6
2026-07-10T09:14:33.4839644Z    Compiling aes-gcm v0.10.3
2026-07-10T09:14:33.6583491Z    Compiling data-encoding-macro v0.1.20
2026-07-10T09:14:33.6930737Z    Compiling num_enum_derive v0.7.6
2026-07-10T09:14:33.6945229Z    Compiling postcard v1.1.3
2026-07-10T09:14:33.8129283Z    Compiling spt-runtime v0.30.6 (C:\actions-runner\_work\spt-core\spt-core\crates\spt-runtime)
2026-07-10T09:14:33.8473152Z    Compiling tower v0.5.3
2026-07-10T09:14:33.8500200Z    Compiling crossbeam-channel v0.5.15
2026-07-10T09:14:33.9595526Z    Compiling crossbeam-epoch v0.9.18
2026-07-10T09:14:34.0223513Z    Compiling chrono v0.4.45
2026-07-10T09:14:34.0383967Z    Compiling iroh-metrics-derive v0.4.1
2026-07-10T09:14:34.2507589Z    Compiling enum-assoc v1.3.0
2026-07-10T09:14:34.5401377Z    Compiling async-trait v0.1.89
2026-07-10T09:14:34.6880200Z    Compiling strum_macros v0.28.0
2026-07-10T09:14:34.6939929Z    Compiling windows-registry v0.6.1
2026-07-10T09:14:34.7020403Z    Compiling blake3 v1.8.5
2026-07-10T09:14:34.7239725Z    Compiling noq v0.18.0
2026-07-10T09:14:34.9276987Z    Compiling netwatch v0.16.0
2026-07-10T09:14:35.0934028Z    Compiling acto v0.8.2
2026-07-10T09:14:35.2971407Z    Compiling tagptr v0.2.0
2026-07-10T09:14:35.7276055Z    Compiling lru-slab v0.1.2
2026-07-10T09:14:35.7289696Z    Compiling sorted-index-buffer v0.2.1
2026-07-10T09:14:35.7762422Z    Compiling identity-hash v0.1.0
2026-07-10T09:14:35.8699538Z    Compiling xml-rs v0.8.28
2026-07-10T09:14:35.8737260Z    Compiling rustc-hash v2.1.2
2026-07-10T09:14:35.8761834Z    Compiling foldhash v0.2.0
2026-07-10T09:14:35.9078932Z    Compiling mac-addr v0.3.0
2026-07-10T09:14:35.9652293Z    Compiling iroh-relay v0.98.0
2026-07-10T09:14:35.9904367Z    Compiling moka v0.12.15
2026-07-10T09:14:36.0538917Z    Compiling hashbrown v0.16.1
2026-07-10T09:14:36.0539334Z    Compiling iroh-metrics v0.38.3
2026-07-10T09:14:36.0772191Z    Compiling num_enum v0.7.6
2026-07-10T09:14:36.1441677Z    Compiling tower-http v0.6.11
2026-07-10T09:14:36.2872562Z    Compiling netdev v0.42.0
2026-07-10T09:14:36.4637326Z    Compiling xmltree v0.10.3
2026-07-10T09:14:36.5975447Z    Compiling iroh-base v0.98.0
2026-07-10T09:14:36.6039612Z    Compiling spt-term v0.30.6 (C:\actions-runner\_work\spt-core\spt-core\crates\spt-term)
2026-07-10T09:14:36.6448524Z    Compiling n0-watcher v0.6.1
2026-07-10T09:14:36.7283996Z    Compiling attohttpc v0.30.1
2026-07-10T09:14:36.8982318Z    Compiling tokio-stream v0.1.18
2026-07-10T09:14:36.9659094Z    Compiling simple-dns v0.9.3
2026-07-10T09:14:37.0879687Z    Compiling constant_time_eq v0.4.2
2026-07-10T09:14:37.1543366Z    Compiling sha1_smol v1.0.1
2026-07-10T09:14:37.1825522Z    Compiling resolv-conf v0.7.6
2026-07-10T09:14:37.3613349Z    Compiling arrayref v0.3.9
2026-07-10T09:14:37.3795569Z    Compiling simdutf8 v0.1.5
2026-07-10T09:14:37.5042979Z    Compiling smol_str v0.1.24
2026-07-10T09:14:37.5805750Z    Compiling igd-next v0.17.1
2026-07-10T09:14:37.7616675Z    Compiling lru v0.16.4
2026-07-10T09:14:37.8286163Z    Compiling webpki-roots v1.0.7
2026-07-10T09:14:37.8387669Z    Compiling seize v0.5.1
2026-07-10T09:14:37.8401546Z    Compiling serde_bytes v0.11.19
2026-07-10T09:14:37.9708153Z    Compiling iroh v0.98.2
2026-07-10T09:14:38.1753912Z    Compiling strum v0.28.0
2026-07-10T09:14:38.3817344Z    Compiling hmac v0.12.1
2026-07-10T09:14:38.4405260Z    Compiling cmov v0.5.4
2026-07-10T09:14:38.4754354Z    Compiling papaya v0.2.4
2026-07-10T09:14:38.5847732Z    Compiling hkdf v0.12.4
2026-07-10T09:14:38.6021736Z    Compiling swarm-discovery v0.6.0-alpha.2
2026-07-10T09:14:38.6860774Z    Compiling iroh-dns v0.98.0
2026-07-10T09:14:38.7058975Z    Compiling ctutils v0.4.2
2026-07-10T09:14:38.7538660Z    Compiling backon v1.6.0
2026-07-10T09:14:38.7782670Z    Compiling spake2 v0.4.0
2026-07-10T09:14:38.7784020Z    Compiling sha1 v0.10.6
2026-07-10T09:14:38.9488864Z    Compiling spt-live v0.30.6 (C:\actions-runner\_work\spt-core\spt-core\crates\spt-live)
2026-07-10T09:14:38.9607445Z    Compiling doctest-file v1.1.1
2026-07-10T09:14:39.0110935Z    Compiling recvmsg v1.0.0
2026-07-10T09:14:39.0312006Z    Compiling darling_core v0.23.0
2026-07-10T09:14:39.2161139Z    Compiling once_cell_polyfill v1.70.2
2026-07-10T09:14:39.2384148Z    Compiling anstyle v1.0.14
2026-07-10T09:14:39.3218498Z    Compiling anstyle-parse v1.0.0
2026-07-10T09:14:39.3499220Z    Compiling anstyle-query v1.1.5
2026-07-10T09:14:39.3897558Z    Compiling foldhash v0.1.5
2026-07-10T09:14:39.4949631Z    Compiling anstyle-wincon v3.0.11
2026-07-10T09:14:39.5651423Z    Compiling instability v0.3.12
2026-07-10T09:14:39.5718826Z    Compiling is_terminal_polyfill v1.70.2
2026-07-10T09:14:39.5739384Z    Compiling paste v1.0.15
2026-07-10T09:14:39.5839138Z    Compiling interprocess v2.4.2
2026-07-10T09:14:39.6739271Z    Compiling colorchoice v1.0.5
2026-07-10T09:14:39.7408569Z    Compiling hashbrown v0.15.5
2026-07-10T09:14:39.7461591Z    Compiling strum_macros v0.26.4
2026-07-10T09:14:39.8607403Z    Compiling anstream v1.0.0
2026-07-10T09:14:39.9047605Z    Compiling itertools v0.13.0
2026-07-10T09:14:40.0934225Z    Compiling terminal_size v0.4.4
2026-07-10T09:14:40.1158860Z    Compiling castaway v0.2.4
2026-07-10T09:14:40.2751246Z    Compiling crossterm_winapi v0.9.1
2026-07-10T09:14:40.3719786Z    Compiling unicode-width v0.1.14
2026-07-10T09:14:40.3793619Z    Compiling indoc v2.0.7
2026-07-10T09:14:40.5331518Z    Compiling static_assertions v1.1.0
2026-07-10T09:14:40.5414756Z    Compiling clap_lex v1.1.0
2026-07-10T09:14:40.5510459Z    Compiling lru v0.12.5
2026-07-10T09:14:40.7863238Z    Compiling clap_builder v4.6.0
2026-07-10T09:14:40.8655608Z    Compiling compact_str v0.8.2
2026-07-10T09:14:40.8670638Z    Compiling crossterm v0.28.1
2026-07-10T09:14:41.0702681Z    Compiling clap_derive v4.6.1
2026-07-10T09:14:41.2660334Z    Compiling error-code v3.3.2
2026-07-10T09:14:41.3781728Z    Compiling cassowary v0.3.0
2026-07-10T09:14:41.6712290Z    Compiling unicode-width v0.2.0
2026-07-10T09:14:41.6740371Z    Compiling clipboard-win v5.4.1
2026-07-10T09:14:41.9551038Z    Compiling unicode-truncate v1.1.0
2026-07-10T09:14:42.0005667Z    Compiling nucleo-matcher v0.3.1
2026-07-10T09:14:42.0273958Z    Compiling qrcode v0.14.1
2026-07-10T09:14:42.6383927Z    Compiling strum v0.26.3
2026-07-10T09:14:43.1022709Z    Compiling darling_macro v0.23.0
2026-07-10T09:14:43.3692142Z    Compiling wmi v0.18.4
2026-07-10T09:14:44.3120743Z    Compiling clap v4.6.1
2026-07-10T09:14:44.3521722Z    Compiling darling v0.23.0
2026-07-10T09:14:44.5885132Z    Compiling mock-adapter v0.30.6 (C:\actions-runner\_work\spt-core\spt-core\adapters\mock)
2026-07-10T09:14:45.6298401Z    Compiling portmapper v0.16.0
2026-07-10T09:14:45.6965475Z    Compiling ratatui v0.29.0
2026-07-10T09:15:02.8430694Z    Compiling rustls-webpki v0.103.13
2026-07-10T09:15:05.4990121Z    Compiling tokio-rustls v0.26.4
2026-07-10T09:15:05.4990545Z    Compiling rustls-platform-verifier v0.7.0
2026-07-10T09:15:05.4990866Z    Compiling noq-proto v0.17.0
2026-07-10T09:15:05.7578211Z    Compiling hickory-net v0.26.0-beta.4
2026-07-10T09:15:05.7578555Z    Compiling hyper-rustls v0.27.9
2026-07-10T09:15:05.7578922Z    Compiling tokio-websockets v0.13.2
2026-07-10T09:15:05.9387379Z    Compiling reqwest v0.13.4
2026-07-10T09:15:07.0033372Z    Compiling hickory-resolver v0.26.0-beta.4
2026-07-10T09:15:24.0347594Z    Compiling spt-net v0.30.6 (C:\actions-runner\_work\spt-core\spt-core\crates\spt-net)
2026-07-10T09:15:25.5012010Z    Compiling spt-daemon v0.30.6 (C:\actions-runner\_work\spt-core\spt-core\crates\spt-daemon)
2026-07-10T09:15:36.7952085Z    Compiling spt v0.30.6 (C:\actions-runner\_work\spt-core\spt-core\crates\spt)
2026-07-10T09:15:37.9787442Z    Compiling xtask v0.30.6 (C:\actions-runner\_work\spt-core\spt-core\crates\xtask)
2026-07-10T09:15:56.4340697Z error: linking with `link.exe` failed: exit code: 1318
2026-07-10T09:15:56.4376914Z   |
2026-07-10T09:15:56.4521053Z   = note: "C:\\Program Files\\Microsoft Visual Studio\\2022\\Community\\VC\\Tools\\MSVC\\14.44.35207\\bin\\HostX64\\x64\\link.exe" "/NOLOGO" "C:\\Users\\decid\\AppData\\Local\\Temp\\rustcZ9oxUK\\symbols.o" "<32 object files omitted>" "<sysroot>\\lib\\rustlib\\x86_64-pc-windows-msvc\\lib/{libtest-*,libgetopts-*,librustc_std_workspace_std-*}.rlib" "C:\\actions-runner\\_work\\spt-core\\spt-core\\target\\debug\\deps/{libspt_daemon-ae9485da2522eab6,libspt_msg-edf40c4516e3c190,libwindows_sys-4cf78ffb6da01f45,libwindows_targets-8f35a6d2410dd7da,libspt_live-6967e9d414c7a698,libspt_term-48df5cce2c3d6ecd,libvte-677706dd7ef8ca75,libutf8parse-2253e9c48e83b79d,libportable_pty-50e6c123745e0772,libshell_words-ffdd3360205ad2fc,libserial-762a942977fa4ffd,libserial_windows-595ce9f6331e1d0c,libserial_core-dabc84def64fd077,libshared_library-a2db4a9aebb8d832,liblazy_static-415441d33699aa40,libfiledescriptor-f02ca740c6786a7d,libthiserror-3a80cdef0093bbd6,libwinreg-ea02f55e042548f0,libdowncast_rs-e6941c4902f6ccd7,libanyhow-7010c653578628de,libinterprocess-95598dbd831d4f3c,librecvmsg-da18d0ea0ced6ffc,libspt_net-c34f959bcaac2d4b,libsha1-e025bb9136e5f60c,libspake2-5d13153ba344aaf0,libhkdf-03831c7172bb7eab,libhmac-e996b185f044bfe1,libiroh-4c470328af3eb2d9,libpapaya-0618444e12d8f34e,libseize-a580e5e5af8e73f4,libswarm_discovery-07646c933e53549c,libacto-d6af9e642e0efc9b,libsmol_str-0f8c0897f08ffcc3,libportmapper-99f547a1380c003f,libigd_next-a1f9c7269c2f9d15,libattohttpc-56adeb9cba311fd3,libxmltree-4a03db13d97258e2,libxml-26483044fbb9318c,libctutils-a0b79bde140935c1,libcmov-4768121674cb5842,libbackon-5b9b222c9d362c61,libiroh_metrics-e13be9867bb4bc83,libryu-42a7cb369c870548,libnetwatch-4898f849e4ce56b8,libtime-c452403aebfbeeb7,libtime_core-be14b7c7919f9d91,libnum_conv-71bf51ac7a809923,libderanged-a1682ca4fd09151c,libpowerfmt-369395662f7ea5c2,libnetdev-b95623619be745e0,libmac_addr-f6740e45d8b44fb1,libwmi-06a01c3c1d29d6be,libfutures-84df367ef8092e27,libfutures_executor-fa6319b9a6f3c4f5,libchrono-f79f64d5f4cffdfd,libwindows-625f3bd0b8d0da3a,libwindows_core-3edf54885fd87c48,libn0_watcher-4c597d1cc8d0d223,libiroh_relay-54054fdff28c3ebc,libreqwest-ac75cf070f34b907,librustls_platform_verifier-6846bdf58951c3ec,libhyper_rustls-7742c2369416aeaf,libtower_http-71626f9beece9530,libtower-640b18737f051c37,libtower_layer-5d61ed3d375f5ba7,libsync_wrapper-33a0c82dec098f0c,liblru-6a2d28235ebddefc,libhashbrown-0be45c82ef4d2fe4,liballocator_api2-74a36ad2ebd40c9a,libfoldhash-63cf3bf441207ef8,libwebpki_roots-0cb47e919c855d01,libblake3-39ad0d1d460848f4,libconstant_time_eq-1b9617d4e0191e55,libarrayvec-b3ba1fb0bd31fc83,libarrayref-49e8e909773af2fa,libpostcard-1a0ba01e940490f0,libheapless-0bd5f7fe4483c57a,libspin-20816efa1c0eb4c1,libhash32-d729de8eba95d24e,libbyteorder-2ab53f25927e0c7b,libcobs-8a5c4c311e9d9e26,libserde_bytes-b513a61f7d547978,libtokio_websockets-aeb401b0f654b4ee,libsimdutf8-667f5f94b8438f8c,libsha1_smol-f4bc01e01fd07ce8,libnum_enum-fe12a30f688bcb7d,libiroh_dns-85912abe4be68870,libsimple_dns-bdedce416bc6f71d,libhickory_resolver-d4891d4aeb6156c4,libipconfig-66d4e77c8d58bf83,libwindows_registry-a9473cf978b94466,libwindows_strings-cdd50a4f08a97da4,libwindows_result-62cf4eed3b09e994,libwidestring-74284839effacb89,libmoka-86162c247365ef8b,libtagptr-9fae91e9c4c5e063,libcrossbeam_epoch-19f0377483d0280a,libcrossbeam_channel-6b095608c42a1ce1,libcrossbeam_utils-ccaed06cd2b6df87,libparking_lot-253b1d58a3dfcdce,libparking_lot_core-698c5356c1f3aef2,liblock_api-f09f5562bffb005d,libscopeguard-8cabf05fe32df8ac,libhickory_net-ba0de1f30139dec8,libtokio_rustls-8f3d91ce9d17c567,libhickory_proto-6fb0903785148aa2,libprefix_trie-716d668f7d8e3d03,libeither-abb73a39c16e4a13,libnum_traits-cdb7e0f32098cee6,libnoq-2dbbac4cdff21eb1,libtokio_stream-8782bf347136b812,libnoq_udp-abdc1b729314be72,liblibc-7f7a05fa01df7784,libnoq_proto-26c2ae5381efc97f,liblru_slab-72432835cdebfe02,libaes_gcm-a9b4ed04f49402ad,libctr-bda13d32cc6c2365,libghash-b06c034c3961670d,libpolyval-1b7b0a4419fb44e1,libopaque_debug-e9366cc65e663f43,libuniversal_hash-f79d2275c185ca63,libaes-c05bcfe4990cc176,libcipher-d7f8e593e73d54f7,libinout-7916ea02a824b55c,libaead-d1b8844edc4d82d4,libsorted_index_buffer-06bd2fb481a2a7be,libidentity_hash-7f9e28b8e2b1e340,librustc_hash-0e5cc03fc932024d,libtinyvec-79a21cfef3249c1a,libtinyvec_macros-7afdc6ba7a0e277d,libthiserror-3d740f595393d8d7,libstrum-5fc1058516af4ce4,libhyper_util-6f2ab7ade649def1,libbase64-b548805f762d34b4,libipnet-960057e6f47d82a4,libtower_service-145c4257e306c319,librustls-7cfaaef60fd7c74d,libwebpki-f6d500c00065fbc0,libaws_lc_rs-a9e6b53100d109d8,libaws_lc_sys-76bfac032332991f,libring-a3d923e71a32a56d,libuntrusted-f9064cf4d7107444,librustls_pki_types-5c2e8c1f48d64884,libhyper-bb193e905a04a989,libwant-bb3b44e7ecaed721,libtry_lock-8f5607fa3b62a4fe,libhttparse-f083573e91be1d29,libh2-54d4eb67a7c153f8,libfnv-cc596fa302da3c18,libatomic_waker-8c014cf46bcfea2d,libhttpdate-246d16398515f7a6,libhttp_body_util-ee0e6ed9b09a7763,libhttp_body-c0de5227f56d9c08,libhttp-de7cbc14c6f3977a,libtracing-98941201e0371249,liblog-92c32a39d373ca8e,libtracing_core-8379ba9026d4cfbe,libn0_future-021aa31d275fd773,libfutures_lite-08f88b6ab89b43bf,libparking-3bf4a70f06527366,libfastrand-a91393f78f5469a7,libfutures_buffered-b3e890b1922f70e1,libspin-f59ac4f4bc84eee6,libdiatomic_waker-e2ef744a8d212d78,libcordyceps-dfd5a12f3fdc2c12,libtokio_util-6f63feb5d4d5aac2,libfutures_util-52ae071499bdb712,libfutures_io-8a588218409a0a72,libslab-7d49860aff740478,libfutures_channel-e025d56841d652fd,libfutures_task-2fba8ee0980d06f0,libfutures_core-7252e840735b8748,libfutures_sink-63e9d960eb265abc,libtokio-5cfdff6656aca6b6,libsocket2-417be51e1115d250,libbytes-7fa99c9996959c98,libmio-21de7cf56980aa08,libwindows_sys-0c9e7361fa9dab2a,libwindows_link-750c1e8395263f2e,libpin_project_lite-8f01750316d5cd7f,libpin_project-d2fd588af98f177a,libiroh_base-cd4eadbe99bc9b3c,librand-de8626ecb355e840,libchacha20-2239626ebe112ec8,libcpufeatures-ad65ba751b109ff1,libderive_more-10c4e33026245ec1,liburl-184633b9c79ab0ce,libidna-2eb1fb52f110159e,libidna_adapter-ee949d5f6ff39d57,libicu_properties-f377ce9aa238cd9c,libicu_properties_data-7931cf8a5dfdba74,libicu_normalizer-1ba3a433e7dc2241,libicu_normalizer_data-de2ccdb037cb6b3c,libicu_collections-299efef37ebf6421,libutf8_iter-8667528961b1857c,libpotential_utf-1fdbd22bc926b6ff,libicu_provider-ed6e031c9f108f07,libicu_locale_core-31e14abb28b75f4c,libtinystr-84a0553a0c094d40,liblitemap-405ce459934fb283,libwriteable-117a37e0863563eb,libzerovec-4ab20b9e3dc34e1d,libzerotrie-2da7be6347e67321,libyoke-2de3e3216a39c9ff,libstable_deref_trait-0e096ff5984b49fc,libzerofrom-af390e71bb95f5c2,libform_urlencoded-75eb2c5d40dbe775,libpercent_encoding-0aff148551bb810a,libed25519_dalek-9a9ee834e9be032c,libsha2-8cace948ae2e6d5f,libed25519-d51a67850575cb9b,libsignature-9671803ce5af0bab,libpkcs8-a1169071690f84d6,libspki-42bd612f542cd5bb,libder-18fe80a7689add1f,libpem_rfc7468-7623dc0ce520a633,libbase64ct-fd7b472ffe3384a9,libdata_encoding_macro-0e54f4c49fccfbf5,libcurve25519_dalek-c46dd87a36559eb7,libdigest-d565164163fe74d3,libconst_oid-a914ddb7b7344c42,libcrypto_common-a2e335e0df3a1e61,libblock_buffer-7cc5b76e81b90f24,libhybrid_array-891ddfc1e3340cc7,libn0_error-2009ee40cb58e819,libdata_encoding-78d18a20fed30b84,libspt_runtime-93f018036417cc71,libregex-4b3d8c0183b6a79f,libregex_automata-86cf6b44556a0444,libaho_corasick-2114ef6e31c299bf,libregex_syntax-43e21e70306c1292,libtoml-f17076c2fafda3bd,libtoml_edit-64fc598b636dff53,libserde_spanned-1f37eec570f37b5f,libwinnow-9060fa526873a459,libtoml_write-cbe0ee03e0822432,libtoml_datetime-452346770fb9ab3a,libschemars-3087fbf68ad7e654,libdyn_clone-2a79e79feefffffc,libref_cast-2a894f8d7459b2eb,libspt_store-4881353c2ae820ef,libuuid-04db0902594e461e,libgetrandom-6e46645e280c4350,librand_core-f5a4f9121bdf1050,libserde_json-17281f0e02bd2a5a,libmemchr-cb0a0fc22acd0836,libitoa-2fadb60393a045de,libzmij-b82215484eee4f22,libindexmap-041aae331fe12ea8,libequivalent-81775ab5d8154b89,libhashbrown-635befb600e68988,libfs2-509ec141a8cd0084,libwinapi-3ada3e42829efa8d,librusqlite-e6410a40587b2412,libbitflags-ac2f1c33302ac4cb,libsmallvec-0351b9b3b0d13bf4,libfallible_streaming_iterator-b9d1906a1096dee7,libfallible_iterator-ed130759af23d6c1,libhashlink-2da09f725f0306bc,libhashbrown-21e87604c4d20056,libahash-7f0b33588d29b971,libonce_cell-413813fe09b89788,libportable_atomic-64fa3d89ee64b215,libzerocopy-50fbb0b48fb600e7,liblibsqlite3_sys-abece50c6a4c2bc2,libspt_proto-db7dbc0885f8410f,libed25519_dalek-97fab2c71a4e1d4b,libsha2-8b10433dc072d985,libcurve25519_dalek-8acc79d327bfa0b2,libcpufeatures-c232fa689cff9078,libzeroize-43316c5fd3484d22,librand_core-d7ec264f3ecb092b,libgetrandom-6d5f68613080b1be,libcfg_if-4be1d57b9cd9afec,libdigest-c21bf9f154372849,libsubtle-3e3d27900247595c,libblock_buffer-7afe031c92b89e1c,libcrypto_common-38bd24d386ad0136,libgeneric_array-6efae25bedc163a0,libtypenum-5b38d9aafac5529f,libed25519-1557411f44961c05,libsignature-7f41cf5669168da2,libserde-2cfe227265f9e30b,libserde_core-3ddf51a30c07af59}.rlib" "<sysroot>\\lib\\rustlib\\x86_64-pc-windows-msvc\\lib/{libstd-*,libpanic_unwind-*,libcfg_if-*,libwindows_targets-*,librustc_demangle-*,libstd_detect-*,libhashbrown-*,librustc_std_workspace_alloc-*,libunwind-*,librustc_std_workspace_core-*,liballoc-*,libcore-*,libcompiler_builtins-*}.rlib" "kernel32.lib" "user32.lib" "userenv.lib" "advapi32.lib" "C:\\Users\\decid\\.cargo\\registry\\src\\index.crates.io-1949cf8c6b5b557f\\windows_x86_64_msvc-0.52.6\\lib\\windows.0.52.0.lib" "iphlpapi.lib" "legacy_stdio_definitions.lib" "advapi32.lib" "cfgmgr32.lib" "gdi32.lib" "kernel32.lib" "msimg32.lib" "opengl32.lib" "synchronization.lib" "user32.lib" "winspool.lib" "ws2_32.lib" "bcrypt.lib" "advapi32.lib" "kernel32.lib" "kernel32.lib" "kernel32.lib" "ntdll.lib" "userenv.lib" "ws2_32.lib" "dbghelp.lib" "/defaultlib:msvcrt" "/NXCOMPAT" "/LIBPATH:C:\\actions-runner\\_work\\spt-core\\spt-core\\target\\debug\\build\\libsqlite3-sys-dfb857ecd39841b9\\out" "/LIBPATH:C:\\actions-runner\\_work\\spt-core\\spt-core\\target\\debug\\build\\blake3-60c87a81e6cc6ba6\\out" "/LIBPATH:C:\\actions-runner\\_work\\spt-core\\spt-core\\target\\debug\\build\\aws-lc-sys-1a05d93e0719da20\\out" "/LIBPATH:C:\\actions-runner\\_work\\spt-core\\spt-core\\target\\debug\\build\\ring-9c61033a2441dbc4\\out" "/LIBPATH:C:\\Program Files\\Microsoft Visual Studio\\2022\\Community\\VC\\Tools\\MSVC\\14.44.35207\\atlmfc\\lib\\x64" "/LIBPATH:C:\\Users\\decid\\.cargo\\registry\\src\\index.crates.io-1949cf8c6b5b557f\\windows_x86_64_msvc-0.52.6\\lib" "/OUT:C:\\actions-runner\\_work\\spt-core\\spt-core\\target\\debug\\deps\\reseed-ea4794ac61c03866.exe" "/OPT:REF,NOICF" "/DEBUG" "/PDBALTPATH:%_PDB%" "/NATVIS:<sysroot>\\lib\\rustlib\\etc\\intrinsic.natvis" "/NATVIS:<sysroot>\\lib\\rustlib\\etc\\liballoc.natvis" "/NATVIS:<sysroot>\\lib\\rustlib\\etc\\libcore.natvis" "/NATVIS:<sysroot>\\lib\\rustlib\\etc\\libstd.natvis" "/NATVIS:C:\\Users\\decid\\AppData\\Local\\Temp\\rustcZ9oxUK\\reseed-0.natvis" "/NATVIS:C:\\Users\\decid\\AppData\\Local\\Temp\\rustcZ9oxUK\\reseed-1.natvis" "/NATVIS:C:\\Users\\decid\\AppData\\Local\\Temp\\rustcZ9oxUK\\reseed-2.natvis"
2026-07-10T09:15:56.4591369Z   = note: some arguments are omitted. use `--verbose` to show all linker arguments
2026-07-10T09:15:56.4596803Z   = note:    Creating library C:\actions-runner\_work\spt-core\spt-core\target\debug\deps\reseed-ea4794ac61c03866.lib and object C:\actions-runner\_work\spt-core\spt-core\target\debug\deps\reseed-ea4794ac61c03866.exp␍
2026-07-10T09:15:56.4598238Z           LINK : fatal error LNK1318: Unexpected PDB error; LIMIT (12) 'C:\actions-runner\_work\spt-core\spt-core\target\debug\deps\reseed-ea4794ac61c03866.pdb'␍
2026-07-10T09:15:56.4598926Z           
2026-07-10T09:15:56.4599031Z 
2026-07-10T09:15:56.5252950Z error: could not compile `spt-daemon` (test "reseed") due to 1 previous error
2026-07-10T09:15:56.5447406Z warning: build failed, waiting for other jobs to finish...
2026-07-10T09:15:57.0952094Z error: linking with `link.exe` failed: exit code: 1318
2026-07-10T09:15:57.0955846Z   |
2026-07-10T09:15:57.1016017Z   = note: "C:\\Program Files\\Microsoft Visual Studio\\2022\\Community\\VC\\Tools\\MSVC\\14.44.35207\\bin\\HostX64\\x64\\link.exe" "/NOLOGO" "C:\\Users\\decid\\AppData\\Local\\Temp\\rustcaFFXvR\\symbols.o" "<71 object files omitted>" "C:\\actions-runner\\_work\\spt-core\\spt-core\\target\\debug\\deps/{libtempfile-e58c7f10086d5d2b,libspt_daemon-ae9485da2522eab6,libspt_msg-edf40c4516e3c190,libwindows_sys-4cf78ffb6da01f45,libwindows_targets-8f35a6d2410dd7da,libspt_live-6967e9d414c7a698,libspt_term-48df5cce2c3d6ecd,libvte-677706dd7ef8ca75,libutf8parse-2253e9c48e83b79d,libportable_pty-50e6c123745e0772,libshell_words-ffdd3360205ad2fc,libserial-762a942977fa4ffd,libserial_windows-595ce9f6331e1d0c,libserial_core-dabc84def64fd077,libshared_library-a2db4a9aebb8d832,liblazy_static-415441d33699aa40,libfiledescriptor-f02ca740c6786a7d,libthiserror-3a80cdef0093bbd6,libwinreg-ea02f55e042548f0,libdowncast_rs-e6941c4902f6ccd7,libanyhow-7010c653578628de,libinterprocess-95598dbd831d4f3c,librecvmsg-da18d0ea0ced6ffc,libspt_net-c34f959bcaac2d4b,libsha1-e025bb9136e5f60c,libspake2-5d13153ba344aaf0,libhkdf-03831c7172bb7eab,libhmac-e996b185f044bfe1,libiroh-4c470328af3eb2d9,libpapaya-0618444e12d8f34e,libseize-a580e5e5af8e73f4,libswarm_discovery-07646c933e53549c,libacto-d6af9e642e0efc9b,libsmol_str-0f8c0897f08ffcc3,libportmapper-99f547a1380c003f,libigd_next-a1f9c7269c2f9d15,libattohttpc-56adeb9cba311fd3,libxmltree-4a03db13d97258e2,libxml-26483044fbb9318c,libctutils-a0b79bde140935c1,libcmov-4768121674cb5842,libbackon-5b9b222c9d362c61,libiroh_metrics-e13be9867bb4bc83,libryu-42a7cb369c870548,libnetwatch-4898f849e4ce56b8,libtime-c452403aebfbeeb7,libtime_core-be14b7c7919f9d91,libnum_conv-71bf51ac7a809923,libderanged-a1682ca4fd09151c,libpowerfmt-369395662f7ea5c2,libnetdev-b95623619be745e0,libmac_addr-f6740e45d8b44fb1,libwmi-06a01c3c1d29d6be,libfutures-84df367ef8092e27,libfutures_executor-fa6319b9a6f3c4f5,libchrono-f79f64d5f4cffdfd,libwindows-625f3bd0b8d0da3a,libwindows_core-3edf54885fd87c48,libn0_watcher-4c597d1cc8d0d223,libiroh_relay-54054fdff28c3ebc,libreqwest-ac75cf070f34b907,librustls_platform_verifier-6846bdf58951c3ec,libhyper_rustls-7742c2369416aeaf,libtower_http-71626f9beece9530,libtower-640b18737f051c37,libtower_layer-5d61ed3d375f5ba7,libsync_wrapper-33a0c82dec098f0c,liblru-6a2d28235ebddefc,libhashbrown-0be45c82ef4d2fe4,liballocator_api2-74a36ad2ebd40c9a,libfoldhash-63cf3bf441207ef8,libwebpki_roots-0cb47e919c855d01,libblake3-39ad0d1d460848f4,libconstant_time_eq-1b9617d4e0191e55,libarrayvec-b3ba1fb0bd31fc83,libarrayref-49e8e909773af2fa,libpostcard-1a0ba01e940490f0,libheapless-0bd5f7fe4483c57a,libspin-20816efa1c0eb4c1,libhash32-d729de8eba95d24e,libbyteorder-2ab53f25927e0c7b,libcobs-8a5c4c311e9d9e26,libserde_bytes-b513a61f7d547978,libtokio_websockets-aeb401b0f654b4ee,libsimdutf8-667f5f94b8438f8c,libsha1_smol-f4bc01e01fd07ce8,libnum_enum-fe12a30f688bcb7d,libiroh_dns-85912abe4be68870,libsimple_dns-bdedce416bc6f71d,libhickory_resolver-d4891d4aeb6156c4,libipconfig-66d4e77c8d58bf83,libwindows_registry-a9473cf978b94466,libwindows_strings-cdd50a4f08a97da4,libwindows_result-62cf4eed3b09e994,libwidestring-74284839effacb89,libmoka-86162c247365ef8b,libtagptr-9fae91e9c4c5e063,libcrossbeam_epoch-19f0377483d0280a,libcrossbeam_channel-6b095608c42a1ce1,libcrossbeam_utils-ccaed06cd2b6df87,libparking_lot-253b1d58a3dfcdce,libparking_lot_core-698c5356c1f3aef2,liblock_api-f09f5562bffb005d,libscopeguard-8cabf05fe32df8ac,libhickory_net-ba0de1f30139dec8,libtokio_rustls-8f3d91ce9d17c567,libhickory_proto-6fb0903785148aa2,libprefix_trie-716d668f7d8e3d03,libeither-abb73a39c16e4a13,libnum_traits-cdb7e0f32098cee6,libnoq-2dbbac4cdff21eb1,libtokio_stream-8782bf347136b812,libnoq_udp-abdc1b729314be72,liblibc-7f7a05fa01df7784,libnoq_proto-26c2ae5381efc97f,liblru_slab-72432835cdebfe02,libaes_gcm-a9b4ed04f49402ad,libctr-bda13d32cc6c2365,libghash-b06c034c3961670d,libpolyval-1b7b0a4419fb44e1,libopaque_debug-e9366cc65e663f43,libuniversal_hash-f79d2275c185ca63,libaes-c05bcfe4990cc176,libcipher-d7f8e593e73d54f7,libinout-7916ea02a824b55c,libaead-d1b8844edc4d82d4,libsorted_index_buffer-06bd2fb481a2a7be,libidentity_hash-7f9e28b8e2b1e340,librustc_hash-0e5cc03fc932024d,libtinyvec-79a21cfef3249c1a,libtinyvec_macros-7afdc6ba7a0e277d,libthiserror-3d740f595393d8d7,libstrum-5fc1058516af4ce4,libhyper_util-6f2ab7ade649def1,libbase64-b548805f762d34b4,libipnet-960057e6f47d82a4,libtower_service-145c4257e306c319,librustls-7cfaaef60fd7c74d,libwebpki-f6d500c00065fbc0,libaws_lc_rs-a9e6b53100d109d8,libaws_lc_sys-76bfac032332991f,libring-a3d923e71a32a56d,libuntrusted-f9064cf4d7107444,librustls_pki_types-5c2e8c1f48d64884,libhyper-bb193e905a04a989,libwant-bb3b44e7ecaed721,libtry_lock-8f5607fa3b62a4fe,libhttparse-f083573e91be1d29,libh2-54d4eb67a7c153f8,libfnv-cc596fa302da3c18,libatomic_waker-8c014cf46bcfea2d,libhttpdate-246d16398515f7a6,libhttp_body_util-ee0e6ed9b09a7763,libhttp_body-c0de5227f56d9c08,libhttp-de7cbc14c6f3977a,libtracing-98941201e0371249,liblog-92c32a39d373ca8e,libtracing_core-8379ba9026d4cfbe,libn0_future-021aa31d275fd773,libfutures_lite-08f88b6ab89b43bf,libparking-3bf4a70f06527366,libfastrand-a91393f78f5469a7,libfutures_buffered-b3e890b1922f70e1,libspin-f59ac4f4bc84eee6,libdiatomic_waker-e2ef744a8d212d78,libcordyceps-dfd5a12f3fdc2c12,libtokio_util-6f63feb5d4d5aac2,libfutures_util-52ae071499bdb712,libfutures_io-8a588218409a0a72,libslab-7d49860aff740478,libfutures_channel-e025d56841d652fd,libfutures_task-2fba8ee0980d06f0,libfutures_core-7252e840735b8748,libfutures_sink-63e9d960eb265abc,libtokio-5cfdff6656aca6b6,libsocket2-417be51e1115d250,libbytes-7fa99c9996959c98,libmio-21de7cf56980aa08,libwindows_sys-0c9e7361fa9dab2a,libwindows_link-750c1e8395263f2e,libpin_project_lite-8f01750316d5cd7f,libpin_project-d2fd588af98f177a,libiroh_base-cd4eadbe99bc9b3c,librand-de8626ecb355e840,libchacha20-2239626ebe112ec8,libcpufeatures-ad65ba751b109ff1,libderive_more-10c4e33026245ec1,liburl-184633b9c79ab0ce,libidna-2eb1fb52f110159e,libidna_adapter-ee949d5f6ff39d57,libicu_properties-f377ce9aa238cd9c,libicu_properties_data-7931cf8a5dfdba74,libicu_normalizer-1ba3a433e7dc2241,libicu_normalizer_data-de2ccdb037cb6b3c,libicu_collections-299efef37ebf6421,libutf8_iter-8667528961b1857c,libpotential_utf-1fdbd22bc926b6ff,libicu_provider-ed6e031c9f108f07,libicu_locale_core-31e14abb28b75f4c,libtinystr-84a0553a0c094d40,liblitemap-405ce459934fb283,libwriteable-117a37e0863563eb,libzerovec-4ab20b9e3dc34e1d,libzerotrie-2da7be6347e67321,libyoke-2de3e3216a39c9ff,libstable_deref_trait-0e096ff5984b49fc,libzerofrom-af390e71bb95f5c2,libform_urlencoded-75eb2c5d40dbe775,libpercent_encoding-0aff148551bb810a,libed25519_dalek-9a9ee834e9be032c,libsha2-8cace948ae2e6d5f,libed25519-d51a67850575cb9b,libsignature-9671803ce5af0bab,libpkcs8-a1169071690f84d6,libspki-42bd612f542cd5bb,libder-18fe80a7689add1f,libpem_rfc7468-7623dc0ce520a633,libbase64ct-fd7b472ffe3384a9,libdata_encoding_macro-0e54f4c49fccfbf5,libcurve25519_dalek-c46dd87a36559eb7,libdigest-d565164163fe74d3,libconst_oid-a914ddb7b7344c42,libcrypto_common-a2e335e0df3a1e61,libblock_buffer-7cc5b76e81b90f24,libhybrid_array-891ddfc1e3340cc7,libn0_error-2009ee40cb58e819,libdata_encoding-78d18a20fed30b84}.rlib" "<sysroot>\\lib\\rustlib\\x86_64-pc-windows-msvc\\lib/{libtest-*,libgetopts-*,librustc_std_workspace_std-*}.rlib" "C:\\actions-runner\\_work\\spt-core\\spt-core\\target\\debug\\deps/{libspt_runtime-93f018036417cc71,libregex-4b3d8c0183b6a79f,libregex_automata-86cf6b44556a0444,libaho_corasick-2114ef6e31c299bf,libregex_syntax-43e21e70306c1292,libspt_store-4881353c2ae820ef,libuuid-04db0902594e461e,libgetrandom-6e46645e280c4350,librand_core-f5a4f9121bdf1050,libfs2-509ec141a8cd0084,libwinapi-3ada3e42829efa8d,librusqlite-e6410a40587b2412,libbitflags-ac2f1c33302ac4cb,libsmallvec-0351b9b3b0d13bf4,libfallible_streaming_iterator-b9d1906a1096dee7,libfallible_iterator-ed130759af23d6c1,libhashlink-2da09f725f0306bc,libhashbrown-21e87604c4d20056,libahash-7f0b33588d29b971,libonce_cell-413813fe09b89788,libportable_atomic-64fa3d89ee64b215,libzerocopy-50fbb0b48fb600e7,liblibsqlite3_sys-abece50c6a4c2bc2,libspt_proto-db7dbc0885f8410f,libed25519_dalek-97fab2c71a4e1d4b,libsha2-8b10433dc072d985,libcurve25519_dalek-8acc79d327bfa0b2,libcpufeatures-c232fa689cff9078,libzeroize-43316c5fd3484d22,librand_core-d7ec264f3ecb092b,libgetrandom-6d5f68613080b1be,libcfg_if-4be1d57b9cd9afec,libdigest-c21bf9f154372849,libsubtle-3e3d27900247595c,libblock_buffer-7afe031c92b89e1c,libcrypto_common-38bd24d386ad0136,libgeneric_array-6efae25bedc163a0,libtypenum-5b38d9aafac5529f,libed25519-1557411f44961c05,libsignature-7f41cf5669168da2,libtoml-f17076c2fafda3bd,libtoml_edit-64fc598b636dff53,libserde_spanned-1f37eec570f37b5f,libwinnow-9060fa526873a459,libtoml_write-cbe0ee03e0822432,libtoml_datetime-452346770fb9ab3a,libschemars-3087fbf68ad7e654,libdyn_clone-2a79e79feefffffc,libserde-2cfe227265f9e30b,libref_cast-2a894f8d7459b2eb,libserde_json-17281f0e02bd2a5a,libmemchr-cb0a0fc22acd0836,libitoa-2fadb60393a045de,libzmij-b82215484eee4f22,libindexmap-041aae331fe12ea8,libequivalent-81775ab5d8154b89,libhashbrown-635befb600e68988,libserde_core-3ddf51a30c07af59}.rlib" "<sysroot>\\lib\\rustlib\\x86_64-pc-windows-msvc\\lib/{libstd-*,libpanic_unwind-*,libcfg_if-*,libwindows_targets-*,librustc_demangle-*,libstd_detect-*,libhashbrown-*,librustc_std_workspace_alloc-*,libunwind-*,librustc_std_workspace_core-*,liballoc-*,libcore-*,libcompiler_builtins-*}.rlib" "user32.lib" "userenv.lib" "advapi32.lib" "C:\\Users\\decid\\.cargo\\registry\\src\\index.crates.io-1949cf8c6b5b557f\\windows_x86_64_msvc-0.52.6\\lib\\windows.0.52.0.lib" "iphlpapi.lib" "legacy_stdio_definitions.lib" "kernel32.lib" "advapi32.lib" "cfgmgr32.lib" "gdi32.lib" "kernel32.lib" "msimg32.lib" "opengl32.lib" "synchronization.lib" "user32.lib" "winspool.lib" "ws2_32.lib" "bcrypt.lib" "advapi32.lib" "kernel32.lib" "kernel32.lib" "kernel32.lib" "ntdll.lib" "userenv.lib" "ws2_32.lib" "dbghelp.lib" "/defaultlib:msvcrt" "/NXCOMPAT" "/LIBPATH:C:\\actions-runner\\_work\\spt-core\\spt-core\\target\\debug\\build\\aws-lc-sys-1a05d93e0719da20\\out" "/LIBPATH:C:\\actions-runner\\_work\\spt-core\\spt-core\\target\\debug\\build\\ring-9c61033a2441dbc4\\out" "/LIBPATH:C:\\actions-runner\\_work\\spt-core\\spt-core\\target\\debug\\build\\libsqlite3-sys-dfb857ecd39841b9\\out" "/LIBPATH:C:\\actions-runner\\_work\\spt-core\\spt-core\\target\\debug\\build\\blake3-60c87a81e6cc6ba6\\out" "/LIBPATH:C:\\Program Files\\Microsoft Visual Studio\\2022\\Community\\VC\\Tools\\MSVC\\14.44.35207\\atlmfc\\lib\\x64" "/LIBPATH:C:\\Users\\decid\\.cargo\\registry\\src\\index.crates.io-1949cf8c6b5b557f\\windows_x86_64_msvc-0.52.6\\lib" "/OUT:C:\\actions-runner\\_work\\spt-core\\spt-core\\target\\debug\\deps\\contract_e2e-6dd5c6fc167bc181.exe" "/OPT:REF,NOICF" "/DEBUG" "/PDBALTPATH:%_PDB%" "/NATVIS:<sysroot>\\lib\\rustlib\\etc\\intrinsic.natvis" "/NATVIS:<sysroot>\\lib\\rustlib\\etc\\liballoc.natvis" "/NATVIS:<sysroot>\\lib\\rustlib\\etc\\libcore.natvis" "/NATVIS:<sysroot>\\lib\\rustlib\\etc\\libstd.natvis" "/NATVIS:C:\\Users\\decid\\AppData\\Local\\Temp\\rustcaFFXvR\\contract_e2e-0.natvis" "/NATVIS:C:\\Users\\decid\\AppData\\Local\\Temp\\rustcaFFXvR\\contract_e2e-1.natvis" "/NATVIS:C:\\Users\\decid\\AppData\\Local\\Temp\\rustcaFFXvR\\contract_e2e-2.natvis"
2026-07-10T09:15:57.1063265Z   = note: some arguments are omitted. use `--verbose` to show all linker arguments
2026-07-10T09:15:57.1064948Z   = note:    Creating library C:\actions-runner\_work\spt-core\spt-core\target\debug\deps\contract_e2e-6dd5c6fc167bc181.lib and object C:\actions-runner\_work\spt-core\spt-core\target\debug\deps\contract_e2e-6dd5c6fc167bc181.exp␍
2026-07-10T09:15:57.1066420Z           LINK : fatal error LNK1318: Unexpected PDB error; LIMIT (12) 'C:\actions-runner\_work\spt-core\spt-core\target\debug\deps\contract_e2e-6dd5c6fc167bc181.pdb'␍
2026-07-10T09:15:57.1067070Z           
2026-07-10T09:15:57.1067184Z 
2026-07-10T09:15:57.1651416Z error: could not compile `spt` (test "contract_e2e") due to 1 previous error
2026-07-10T09:15:57.1894042Z rustc-LLVM ERROR: IO failure on output stream: no space on device
2026-07-10T09:15:57.1957916Z rustc-LLVM ERROR: IO failure on output stream: no space on device
2026-07-10T09:15:57.1967201Z rustc-LLVM ERROR: IO failure on output stream: no space on device
2026-07-10T09:15:57.2576850Z error: could not compile `spt` (test "resume_no_control_steal_e2e")
2026-07-10T09:15:57.2577329Z 
2026-07-10T09:15:57.2586430Z Caused by:
2026-07-10T09:15:57.2611713Z   process didn't exit successfully: `C:\Users\decid\.rustup\toolchains\stable-x86_64-pc-windows-msvc\bin\rustc.exe --crate-name resume_no_control_steal_e2e --edition=2021 crates\spt\tests\resume_no_control_steal_e2e.rs --error-format=json --json=diagnostic-rendered-ansi,artifacts,future-incompat --emit=dep-info,link -C embed-bitcode=no -C debuginfo=2 --test --check-cfg cfg(docsrs,test) --check-cfg "cfg(feature, values())" -C metadata=93c5c6cc544011b3 -C extra-filename=-c7709945eb1593eb --out-dir C:\actions-runner\_work\spt-core\spt-core\target\debug\deps -C incremental=C:\actions-runner\_work\spt-core\spt-core\target\debug\incremental -L dependency=C:\actions-runner\_work\spt-core\spt-core\target\debug\deps --extern chrono=C:\actions-runner\_work\spt-core\spt-core\target\debug\deps\libchrono-f79f64d5f4cffdfd.rlib --extern clap=C:\actions-runner\_work\spt-core\spt-core\target\debug\deps\libclap-01c253244fa62239.rlib --extern clipboard_win=C:\actions-runner\_work\spt-core\spt-core\target\debug\deps\libclipboard_win-ae0c4ec0fd906a74.rlib --extern crossterm=C:\actions-runner\_work\spt-core\spt-core\target\debug\deps\libcrossterm-0600ed01caa7ade7.rlib --extern nucleo_matcher=C:\actions-runner\_work\spt-core\spt-core\target\debug\deps\libnucleo_matcher-e203e9b464791ab4.rlib --extern qrcode=C:\actions-runner\_work\spt-core\spt-core\target\debug\deps\libqrcode-49555c755aa3d5a9.rlib --extern ratatui=C:\actions-runner\_work\spt-core\spt-core\target\debug\deps\libratatui-100f6dce9e257962.rlib --extern reqwest=C:\actions-runner\_work\spt-core\spt-core\target\debug\deps\libreqwest-ac75cf070f34b907.rlib --extern serde=C:\actions-runner\_work\spt-core\spt-core\target\debug\deps\libserde-2cfe227265f9e30b.rlib --extern serde_json=C:\actions-runner\_work\spt-core\spt-core\target\debug\deps\libserde_json-17281f0e02bd2a5a.rlib --extern sha2=C:\actions-runner\_work\spt-core\spt-core\target\debug\deps\libsha2-8b10433dc072d985.rlib --extern spt_daemon=C:\actions-runner\_work\spt-core\spt-core\target\debug\deps\libspt_daemon-ae9485da2522eab6.rlib --extern spt_live=C:\actions-runner\_work\spt-core\spt-core\target\debug\deps\libspt_live-6967e9d414c7a698.rlib --extern spt_msg=C:\actions-runner\_work\spt-core\spt-core\target\debug\deps\libspt_msg-edf40c4516e3c190.rlib --extern spt_net=C:\actions-runner\_work\spt-core\spt-core\target\debug\deps\libspt_net-c34f959bcaac2d4b.rlib --extern spt_proto=C:\actions-runner\_work\spt-core\spt-core\target\debug\deps\libspt_proto-db7dbc0885f8410f.rlib --extern spt_runtime=C:\actions-runner\_work\spt-core\spt-core\target\debug\deps\libspt_runtime-93f018036417cc71.rlib --extern spt_store=C:\actions-runner\_work\spt-core\spt-core\target\debug\deps\libspt_store-4881353c2ae820ef.rlib --extern spt_term=C:\actions-runner\_work\spt-core\spt-core\target\debug\deps\libspt_term-48df5cce2c3d6ecd.rlib --extern tempfile=C:\actions-runner\_work\spt-core\spt-core\target\debug\deps\libtempfile-e58c7f10086d5d2b.rlib --extern toml=C:\actions-runner\_work\spt-core\spt-core\target\debug\deps\libtoml-f17076c2fafda3bd.rlib --extern windows_sys=C:\actions-runner\_work\spt-core\spt-core\target\debug\deps\libwindows_sys-4cf78ffb6da01f45.rlib -L native=C:\actions-runner\_work\spt-core\spt-core\target\debug\build\aws-lc-sys-1a05d93e0719da20\out -L native=C:\actions-runner\_work\spt-core\spt-core\target\debug\build\ring-9c61033a2441dbc4\out -L native=C:\actions-runner\_work\spt-core\spt-core\target\debug\build\libsqlite3-sys-dfb857ecd39841b9\out -L native=C:\actions-runner\_work\spt-core\spt-core\target\debug\build\blake3-60c87a81e6cc6ba6\out -L native=C:\actions-runner\_work\spt-core\spt-core\target\debug\build\blake3-60c87a81e6cc6ba6\out -L "native=C:\Program Files\Microsoft Visual Studio\2022\Community\VC\Tools\MSVC\14.44.35207\atlmfc\lib\x64" -L "native=C:\Program Files\Microsoft Visual Studio\2022\Community\VC\Tools\MSVC\14.44.35207\atlmfc\lib\x64" -L native=C:\Users\decid\.cargo\registry\src\index.crates.io-1949cf8c6b5b557f\windows_x86_64_msvc-0.52.6\lib -L "native=C:\Program Files\Microsoft Visual Studio\2022\Community\VC\Tools\MSVC\14.44.35207\atlmfc\lib\x64" -L "native=C:\Program Files\Microsoft Visual Studio\2022\Community\VC\Tools\MSVC\14.44.35207\atlmfc\lib\x64"` (exit code: 101)
2026-07-10T09:15:57.2629665Z error: could not compile `spt` (bin "spt")
2026-07-10T09:15:57.2630369Z 
2026-07-10T09:15:57.2630617Z Caused by:
2026-07-10T09:15:57.2649730Z   process didn't exit successfully: `C:\Users\decid\.rustup\toolchains\stable-x86_64-pc-windows-msvc\bin\rustc.exe --crate-name spt --edition=2021 crates\spt\src\main.rs --error-format=json --json=diagnostic-rendered-ansi,artifacts,future-incompat --crate-type bin --emit=dep-info,link -C embed-bitcode=no -C debuginfo=2 --check-cfg cfg(docsrs,test) --check-cfg "cfg(feature, values())" -C metadata=d61bc016c76d6094 --out-dir C:\actions-runner\_work\spt-core\spt-core\target\debug\deps -C incremental=C:\actions-runner\_work\spt-core\spt-core\target\debug\incremental -L dependency=C:\actions-runner\_work\spt-core\spt-core\target\debug\deps --extern chrono=C:\actions-runner\_work\spt-core\spt-core\target\debug\deps\libchrono-f79f64d5f4cffdfd.rlib --extern clap=C:\actions-runner\_work\spt-core\spt-core\target\debug\deps\libclap-01c253244fa62239.rlib --extern clipboard_win=C:\actions-runner\_work\spt-core\spt-core\target\debug\deps\libclipboard_win-ae0c4ec0fd906a74.rlib --extern crossterm=C:\actions-runner\_work\spt-core\spt-core\target\debug\deps\libcrossterm-0600ed01caa7ade7.rlib --extern nucleo_matcher=C:\actions-runner\_work\spt-core\spt-core\target\debug\deps\libnucleo_matcher-e203e9b464791ab4.rlib --extern qrcode=C:\actions-runner\_work\spt-core\spt-core\target\debug\deps\libqrcode-49555c755aa3d5a9.rlib --extern ratatui=C:\actions-runner\_work\spt-core\spt-core\target\debug\deps\libratatui-100f6dce9e257962.rlib --extern reqwest=C:\actions-runner\_work\spt-core\spt-core\target\debug\deps\libreqwest-ac75cf070f34b907.rlib --extern serde=C:\actions-runner\_work\spt-core\spt-core\target\debug\deps\libserde-2cfe227265f9e30b.rlib --extern serde_json=C:\actions-runner\_work\spt-core\spt-core\target\debug\deps\libserde_json-17281f0e02bd2a5a.rlib --extern spt_daemon=C:\actions-runner\_work\spt-core\spt-core\target\debug\deps\libspt_daemon-ae9485da2522eab6.rlib --extern spt_live=C:\actions-runner\_work\spt-core\spt-core\target\debug\deps\libspt_live-6967e9d414c7a698.rlib --extern spt_msg=C:\actions-runner\_work\spt-core\spt-core\target\debug\deps\libspt_msg-edf40c4516e3c190.rlib --extern spt_net=C:\actions-runner\_work\spt-core\spt-core\target\debug\deps\libspt_net-c34f959bcaac2d4b.rlib --extern spt_proto=C:\actions-runner\_work\spt-core\spt-core\target\debug\deps\libspt_proto-db7dbc0885f8410f.rlib --extern spt_runtime=C:\actions-runner\_work\spt-core\spt-core\target\debug\deps\libspt_runtime-93f018036417cc71.rlib --extern spt_store=C:\actions-runner\_work\spt-core\spt-core\target\debug\deps\libspt_store-4881353c2ae820ef.rlib --extern spt_term=C:\actions-runner\_work\spt-core\spt-core\target\debug\deps\libspt_term-48df5cce2c3d6ecd.rlib --extern windows_sys=C:\actions-runner\_work\spt-core\spt-core\target\debug\deps\libwindows_sys-4cf78ffb6da01f45.rlib -L native=C:\actions-runner\_work\spt-core\spt-core\target\debug\build\aws-lc-sys-1a05d93e0719da20\out -L native=C:\actions-runner\_work\spt-core\spt-core\target\debug\build\ring-9c61033a2441dbc4\out -L native=C:\actions-runner\_work\spt-core\spt-core\target\debug\build\libsqlite3-sys-dfb857ecd39841b9\out -L native=C:\actions-runner\_work\spt-core\spt-core\target\debug\build\blake3-60c87a81e6cc6ba6\out -L native=C:\actions-runner\_work\spt-core\spt-core\target\debug\build\blake3-60c87a81e6cc6ba6\out -L "native=C:\Program Files\Microsoft Visual Studio\2022\Community\VC\Tools\MSVC\14.44.35207\atlmfc\lib\x64" -L "native=C:\Program Files\Microsoft Visual Studio\2022\Community\VC\Tools\MSVC\14.44.35207\atlmfc\lib\x64" -L native=C:\Users\decid\.cargo\registry\src\index.crates.io-1949cf8c6b5b557f\windows_x86_64_msvc-0.52.6\lib -L "native=C:\Program Files\Microsoft Visual Studio\2022\Community\VC\Tools\MSVC\14.44.35207\atlmfc\lib\x64" -L "native=C:\Program Files\Microsoft Visual Studio\2022\Community\VC\Tools\MSVC\14.44.35207\atlmfc\lib\x64"` (exit code: 101)
2026-07-10T09:15:57.3473520Z error: could not compile `spt-daemon` (lib test)
2026-07-10T09:15:57.3474455Z 
2026-07-10T09:15:57.3474659Z Caused by:
2026-07-10T09:15:57.3495431Z   process didn't exit successfully: `C:\Users\decid\.rustup\toolchains\stable-x86_64-pc-windows-msvc\bin\rustc.exe --crate-name spt_daemon --edition=2021 crates\spt-daemon\src\lib.rs --error-format=json --json=diagnostic-rendered-ansi,artifacts,future-incompat --emit=dep-info,link -C embed-bitcode=no -C debuginfo=2 --test --check-cfg cfg(docsrs,test) --check-cfg "cfg(feature, values())" -C metadata=68ecfd26168d1259 -C extra-filename=-b5ecf22170343159 --out-dir C:\actions-runner\_work\spt-core\spt-core\target\debug\deps -C incremental=C:\actions-runner\_work\spt-core\spt-core\target\debug\incremental -L dependency=C:\actions-runner\_work\spt-core\spt-core\target\debug\deps --extern base64=C:\actions-runner\_work\spt-core\spt-core\target\debug\deps\libbase64-b548805f762d34b4.rlib --extern ed25519_dalek=C:\actions-runner\_work\spt-core\spt-core\target\debug\deps\libed25519_dalek-97fab2c71a4e1d4b.rlib --extern hmac=C:\actions-runner\_work\spt-core\spt-core\target\debug\deps\libhmac-e996b185f044bfe1.rlib --extern interprocess=C:\actions-runner\_work\spt-core\spt-core\target\debug\deps\libinterprocess-95598dbd831d4f3c.rlib --extern serde=C:\actions-runner\_work\spt-core\spt-core\target\debug\deps\libserde-2cfe227265f9e30b.rlib --extern serde_json=C:\actions-runner\_work\spt-core\spt-core\target\debug\deps\libserde_json-17281f0e02bd2a5a.rlib --extern sha2=C:\actions-runner\_work\spt-core\spt-core\target\debug\deps\libsha2-8b10433dc072d985.rlib --extern spt_live=C:\actions-runner\_work\spt-core\spt-core\target\debug\deps\libspt_live-6967e9d414c7a698.rlib --extern spt_msg=C:\actions-runner\_work\spt-core\spt-core\target\debug\deps\libspt_msg-edf40c4516e3c190.rlib --extern spt_net=C:\actions-runner\_work\spt-core\spt-core\target\debug\deps\libspt_net-c34f959bcaac2d4b.rlib --extern spt_proto=C:\actions-runner\_work\spt-core\spt-core\target\debug\deps\libspt_proto-db7dbc0885f8410f.rlib --extern spt_runtime=C:\actions-runner\_work\spt-core\spt-core\target\debug\deps\libspt_runtime-93f018036417cc71.rlib --extern spt_store=C:\actions-runner\_work\spt-core\spt-core\target\debug\deps\libspt_store-4881353c2ae820ef.rlib --extern spt_term=C:\actions-runner\_work\spt-core\spt-core\target\debug\deps\libspt_term-48df5cce2c3d6ecd.rlib --extern tempfile=C:\actions-runner\_work\spt-core\spt-core\target\debug\deps\libtempfile-e58c7f10086d5d2b.rlib --extern tokio=C:\actions-runner\_work\spt-core\spt-core\target\debug\deps\libtokio-5cfdff6656aca6b6.rlib -L native=C:\actions-runner\_work\spt-core\spt-core\target\debug\build\libsqlite3-sys-dfb857ecd39841b9\out -L native=C:\actions-runner\_work\spt-core\spt-core\target\debug\build\blake3-60c87a81e6cc6ba6\out -L native=C:\actions-runner\_work\spt-core\spt-core\target\debug\build\blake3-60c87a81e6cc6ba6\out -L native=C:\actions-runner\_work\spt-core\spt-core\target\debug\build\aws-lc-sys-1a05d93e0719da20\out -L native=C:\actions-runner\_work\spt-core\spt-core\target\debug\build\ring-9c61033a2441dbc4\out -L "native=C:\Program Files\Microsoft Visual Studio\2022\Community\VC\Tools\MSVC\14.44.35207\atlmfc\lib\x64" -L native=C:\Users\decid\.cargo\registry\src\index.crates.io-1949cf8c6b5b557f\windows_x86_64_msvc-0.52.6\lib -L "native=C:\Program Files\Microsoft Visual Studio\2022\Community\VC\Tools\MSVC\14.44.35207\atlmfc\lib\x64" -L "native=C:\Program Files\Microsoft Visual Studio\2022\Community\VC\Tools\MSVC\14.44.35207\atlmfc\lib\x64" -L "native=C:\Program Files\Microsoft Visual Studio\2022\Community\VC\Tools\MSVC\14.44.35207\atlmfc\lib\x64"` (exit code: 101)
2026-07-10T09:15:57.4158165Z error: linking with `link.exe` failed: exit code: 1140
2026-07-10T09:15:57.4159437Z   |
2026-07-10T09:15:57.4178522Z   = note: "C:\\Program Files\\Microsoft Visual Studio\\2022\\Community\\VC\\Tools\\MSVC\\14.44.35207\\bin\\HostX64\\x64\\link.exe" "/NOLOGO" "C:\\Users\\decid\\AppData\\Local\\Temp\\rustct3s91e\\symbols.o" "<89 object files omitted>" "C:\\actions-runner\\_work\\spt-core\\spt-core\\target\\debug\\deps/{libspt_runtime-93f018036417cc71,libregex-4b3d8c0183b6a79f,libregex_automata-86cf6b44556a0444,libaho_corasick-2114ef6e31c299bf,libregex_syntax-43e21e70306c1292,libtoml-f17076c2fafda3bd,libtoml_edit-64fc598b636dff53,libserde_spanned-1f37eec570f37b5f,libwinnow-9060fa526873a459,libtoml_write-cbe0ee03e0822432,libtoml_datetime-452346770fb9ab3a,libschemars-3087fbf68ad7e654,libdyn_clone-2a79e79feefffffc,libref_cast-2a894f8d7459b2eb,libtempfile-e58c7f10086d5d2b,libfastrand-a91393f78f5469a7,libwindows_sys-0c9e7361fa9dab2a,libwindows_link-750c1e8395263f2e}.rlib" "<sysroot>\\lib\\rustlib\\x86_64-pc-windows-msvc\\lib/{libtest-*,libgetopts-*,librustc_std_workspace_std-*}.rlib" "C:\\actions-runner\\_work\\spt-core\\spt-core\\target\\debug\\deps/{libspt_store-4881353c2ae820ef,libuuid-04db0902594e461e,libgetrandom-6e46645e280c4350,librand_core-f5a4f9121bdf1050,libserde_json-17281f0e02bd2a5a,libmemchr-cb0a0fc22acd0836,libitoa-2fadb60393a045de,libzmij-b82215484eee4f22,libindexmap-041aae331fe12ea8,libequivalent-81775ab5d8154b89,libhashbrown-635befb600e68988,libfs2-509ec141a8cd0084,libwinapi-3ada3e42829efa8d,librusqlite-e6410a40587b2412,libbitflags-ac2f1c33302ac4cb,libsmallvec-0351b9b3b0d13bf4,libfallible_streaming_iterator-b9d1906a1096dee7,libfallible_iterator-ed130759af23d6c1,libhashlink-2da09f725f0306bc,libhashbrown-21e87604c4d20056,libahash-7f0b33588d29b971,libonce_cell-413813fe09b89788,libportable_atomic-64fa3d89ee64b215,libzerocopy-50fbb0b48fb600e7,liblibsqlite3_sys-abece50c6a4c2bc2,libspt_proto-db7dbc0885f8410f,libed25519_dalek-97fab2c71a4e1d4b,libsha2-8b10433dc072d985,libcurve25519_dalek-8acc79d327bfa0b2,libcpufeatures-c232fa689cff9078,libzeroize-43316c5fd3484d22,librand_core-d7ec264f3ecb092b,libgetrandom-6d5f68613080b1be,libcfg_if-4be1d57b9cd9afec,libdigest-c21bf9f154372849,libsubtle-3e3d27900247595c,libblock_buffer-7afe031c92b89e1c,libcrypto_common-38bd24d386ad0136,libgeneric_array-6efae25bedc163a0,libtypenum-5b38d9aafac5529f,libed25519-1557411f44961c05,libsignature-7f41cf5669168da2,libserde-2cfe227265f9e30b,libserde_core-3ddf51a30c07af59}.rlib" "<sysroot>\\lib\\rustlib\\x86_64-pc-windows-msvc\\lib/{libstd-*,libpanic_unwind-*,libcfg_if-*,libwindows_targets-*,librustc_demangle-*,libstd_detect-*,libhashbrown-*,librustc_std_workspace_alloc-*,libunwind-*,librustc_std_workspace_core-*,liballoc-*,libcore-*,libcompiler_builtins-*}.rlib" "kernel32.lib" "advapi32.lib" "cfgmgr32.lib" "gdi32.lib" "kernel32.lib" "msimg32.lib" "opengl32.lib" "synchronization.lib" "user32.lib" "winspool.lib" "ws2_32.lib" "bcrypt.lib" "advapi32.lib" "kernel32.lib" "kernel32.lib" "kernel32.lib" "ntdll.lib" "userenv.lib" "ws2_32.lib" "dbghelp.lib" "/defaultlib:msvcrt" "/NXCOMPAT" "/LIBPATH:C:\\actions-runner\\_work\\spt-core\\spt-core\\target\\debug\\build\\aws-lc-sys-1a05d93e0719da20\\out" "/LIBPATH:C:\\actions-runner\\_work\\spt-core\\spt-core\\target\\debug\\build\\ring-9c61033a2441dbc4\\out" "/LIBPATH:C:\\actions-runner\\_work\\spt-core\\spt-core\\target\\debug\\build\\libsqlite3-sys-dfb857ecd39841b9\\out" "/LIBPATH:C:\\actions-runner\\_work\\spt-core\\spt-core\\target\\debug\\build\\blake3-60c87a81e6cc6ba6\\out" "/LIBPATH:C:\\Program Files\\Microsoft Visual Studio\\2022\\Community\\VC\\Tools\\MSVC\\14.44.35207\\atlmfc\\lib\\x64" "/LIBPATH:C:\\Users\\decid\\.cargo\\registry\\src\\index.crates.io-1949cf8c6b5b557f\\windows_x86_64_msvc-0.52.6\\lib" "/OUT:C:\\actions-runner\\_work\\spt-core\\spt-core\\target\\debug\\deps\\idle_edge_drain_e2e-333d7c3cb03e2cc3.exe" "/OPT:REF,NOICF" "/DEBUG" "/PDBALTPATH:%_PDB%" "/NATVIS:<sysroot>\\lib\\rustlib\\etc\\intrinsic.natvis" "/NATVIS:<sysroot>\\lib\\rustlib\\etc\\liballoc.natvis" "/NATVIS:<sysroot>\\lib\\rustlib\\etc\\libcore.natvis" "/NATVIS:<sysroot>\\lib\\rustlib\\etc\\libstd.natvis"
2026-07-10T09:15:57.4197544Z   = note: some arguments are omitted. use `--verbose` to show all linker arguments
2026-07-10T09:15:57.4199373Z   = note: C:\actions-runner\_work\spt-core\spt-core\target\debug\deps\idle_edge_drain_e2e-333d7c3cb03e2cc3.exe : fatal error LNK1180: insufficient disk space to complete link␍
2026-07-10T09:15:57.4200119Z           
2026-07-10T09:15:57.4200237Z 
2026-07-10T09:15:57.4503456Z error: could not compile `spt` (test "idle_edge_drain_e2e") due to 1 previous error
2026-07-10T09:15:57.7882668Z error: linking with `link.exe` failed: exit code: 1201
2026-07-10T09:15:57.7883082Z   |
2026-07-10T09:15:57.7986627Z   = note: "C:\\Program Files\\Microsoft Visual Studio\\2022\\Community\\VC\\Tools\\MSVC\\14.44.35207\\bin\\HostX64\\x64\\link.exe" "/NOLOGO" "C:\\Users\\decid\\AppData\\Local\\Temp\\rustcAarZLz\\symbols.o" "<36 object files omitted>" "C:\\actions-runner\\_work\\spt-core\\spt-core\\target\\debug\\deps/libtempfile-e58c7f10086d5d2b.rlib" "<sysroot>\\lib\\rustlib\\x86_64-pc-windows-msvc\\lib/{libtest-*,libgetopts-*,librustc_std_workspace_std-*}.rlib" "C:\\actions-runner\\_work\\spt-core\\spt-core\\target\\debug\\deps/{libspt_daemon-ae9485da2522eab6,libspt_msg-edf40c4516e3c190,libwindows_sys-4cf78ffb6da01f45,libwindows_targets-8f35a6d2410dd7da,libspt_live-6967e9d414c7a698,libspt_term-48df5cce2c3d6ecd,libvte-677706dd7ef8ca75,libutf8parse-2253e9c48e83b79d,libportable_pty-50e6c123745e0772,libshell_words-ffdd3360205ad2fc,libserial-762a942977fa4ffd,libserial_windows-595ce9f6331e1d0c,libserial_core-dabc84def64fd077,libshared_library-a2db4a9aebb8d832,liblazy_static-415441d33699aa40,libfiledescriptor-f02ca740c6786a7d,libthiserror-3a80cdef0093bbd6,libwinreg-ea02f55e042548f0,libdowncast_rs-e6941c4902f6ccd7,libanyhow-7010c653578628de,libinterprocess-95598dbd831d4f3c,librecvmsg-da18d0ea0ced6ffc,libspt_net-c34f959bcaac2d4b,libsha1-e025bb9136e5f60c,libspake2-5d13153ba344aaf0,libhkdf-03831c7172bb7eab,libhmac-e996b185f044bfe1,libiroh-4c470328af3eb2d9,libpapaya-0618444e12d8f34e,libseize-a580e5e5af8e73f4,libswarm_discovery-07646c933e53549c,libacto-d6af9e642e0efc9b,libsmol_str-0f8c0897f08ffcc3,libportmapper-99f547a1380c003f,libigd_next-a1f9c7269c2f9d15,libattohttpc-56adeb9cba311fd3,libxmltree-4a03db13d97258e2,libxml-26483044fbb9318c,libctutils-a0b79bde140935c1,libcmov-4768121674cb5842,libbackon-5b9b222c9d362c61,libiroh_metrics-e13be9867bb4bc83,libryu-42a7cb369c870548,libnetwatch-4898f849e4ce56b8,libtime-c452403aebfbeeb7,libtime_core-be14b7c7919f9d91,libnum_conv-71bf51ac7a809923,libderanged-a1682ca4fd09151c,libpowerfmt-369395662f7ea5c2,libnetdev-b95623619be745e0,libmac_addr-f6740e45d8b44fb1,libwmi-06a01c3c1d29d6be,libfutures-84df367ef8092e27,libfutures_executor-fa6319b9a6f3c4f5,libchrono-f79f64d5f4cffdfd,libwindows-625f3bd0b8d0da3a,libwindows_core-3edf54885fd87c48,libn0_watcher-4c597d1cc8d0d223,libiroh_relay-54054fdff28c3ebc,libreqwest-ac75cf070f34b907,librustls_platform_verifier-6846bdf58951c3ec,libhyper_rustls-7742c2369416aeaf,libtower_http-71626f9beece9530,libtower-640b18737f051c37,libtower_layer-5d61ed3d375f5ba7,libsync_wrapper-33a0c82dec098f0c,liblru-6a2d28235ebddefc,libhashbrown-0be45c82ef4d2fe4,liballocator_api2-74a36ad2ebd40c9a,libfoldhash-63cf3bf441207ef8,libwebpki_roots-0cb47e919c855d01,libblake3-39ad0d1d460848f4,libconstant_time_eq-1b9617d4e0191e55,libarrayvec-b3ba1fb0bd31fc83,libarrayref-49e8e909773af2fa,libpostcard-1a0ba01e940490f0,libheapless-0bd5f7fe4483c57a,libspin-20816efa1c0eb4c1,libhash32-d729de8eba95d24e,libbyteorder-2ab53f25927e0c7b,libcobs-8a5c4c311e9d9e26,libserde_bytes-b513a61f7d547978,libtokio_websockets-aeb401b0f654b4ee,libsimdutf8-667f5f94b8438f8c,libsha1_smol-f4bc01e01fd07ce8,libnum_enum-fe12a30f688bcb7d,libiroh_dns-85912abe4be68870,libsimple_dns-bdedce416bc6f71d,libhickory_resolver-d4891d4aeb6156c4,libipconfig-66d4e77c8d58bf83,libwindows_registry-a9473cf978b94466,libwindows_strings-cdd50a4f08a97da4,libwindows_result-62cf4eed3b09e994,libwidestring-74284839effacb89,libmoka-86162c247365ef8b,libtagptr-9fae91e9c4c5e063,libcrossbeam_epoch-19f0377483d0280a,libcrossbeam_channel-6b095608c42a1ce1,libcrossbeam_utils-ccaed06cd2b6df87,libparking_lot-253b1d58a3dfcdce,libparking_lot_core-698c5356c1f3aef2,liblock_api-f09f5562bffb005d,libscopeguard-8cabf05fe32df8ac,libhickory_net-ba0de1f30139dec8,libtokio_rustls-8f3d91ce9d17c567,libhickory_proto-6fb0903785148aa2,libprefix_trie-716d668f7d8e3d03,libeither-abb73a39c16e4a13,libnum_traits-cdb7e0f32098cee6,libnoq-2dbbac4cdff21eb1,libtokio_stream-8782bf347136b812,libnoq_udp-abdc1b729314be72,liblibc-7f7a05fa01df7784,libnoq_proto-26c2ae5381efc97f,liblru_slab-72432835cdebfe02,libaes_gcm-a9b4ed04f49402ad,libctr-bda13d32cc6c2365,libghash-b06c034c3961670d,libpolyval-1b7b0a4419fb44e1,libopaque_debug-e9366cc65e663f43,libuniversal_hash-f79d2275c185ca63,libaes-c05bcfe4990cc176,libcipher-d7f8e593e73d54f7,libinout-7916ea02a824b55c,libaead-d1b8844edc4d82d4,libsorted_index_buffer-06bd2fb481a2a7be,libidentity_hash-7f9e28b8e2b1e340,librustc_hash-0e5cc03fc932024d,libtinyvec-79a21cfef3249c1a,libtinyvec_macros-7afdc6ba7a0e277d,libthiserror-3d740f595393d8d7,libstrum-5fc1058516af4ce4,libhyper_util-6f2ab7ade649def1,libbase64-b548805f762d34b4,libipnet-960057e6f47d82a4,libtower_service-145c4257e306c319,librustls-7cfaaef60fd7c74d,libwebpki-f6d500c00065fbc0,libaws_lc_rs-a9e6b53100d109d8,libaws_lc_sys-76bfac032332991f,libring-a3d923e71a32a56d,libuntrusted-f9064cf4d7107444,librustls_pki_types-5c2e8c1f48d64884,libhyper-bb193e905a04a989,libwant-bb3b44e7ecaed721,libtry_lock-8f5607fa3b62a4fe,libhttparse-f083573e91be1d29,libh2-54d4eb67a7c153f8,libfnv-cc596fa302da3c18,libatomic_waker-8c014cf46bcfea2d,libhttpdate-246d16398515f7a6,libhttp_body_util-ee0e6ed9b09a7763,libhttp_body-c0de5227f56d9c08,libhttp-de7cbc14c6f3977a,libtracing-98941201e0371249,liblog-92c32a39d373ca8e,libtracing_core-8379ba9026d4cfbe,libn0_future-021aa31d275fd773,libfutures_lite-08f88b6ab89b43bf,libparking-3bf4a70f06527366,libfastrand-a91393f78f5469a7,libfutures_buffered-b3e890b1922f70e1,libspin-f59ac4f4bc84eee6,libdiatomic_waker-e2ef744a8d212d78,libcordyceps-dfd5a12f3fdc2c12,libtokio_util-6f63feb5d4d5aac2,libfutures_util-52ae071499bdb712,libfutures_io-8a588218409a0a72,libslab-7d49860aff740478,libfutures_channel-e025d56841d652fd,libfutures_task-2fba8ee0980d06f0,libfutures_core-7252e840735b8748,libfutures_sink-63e9d960eb265abc,libtokio-5cfdff6656aca6b6,libsocket2-417be51e1115d250,libbytes-7fa99c9996959c98,libmio-21de7cf56980aa08,libwindows_sys-0c9e7361fa9dab2a,libwindows_link-750c1e8395263f2e,libpin_project_lite-8f01750316d5cd7f,libpin_project-d2fd588af98f177a,libiroh_base-cd4eadbe99bc9b3c,librand-de8626ecb355e840,libchacha20-2239626ebe112ec8,libcpufeatures-ad65ba751b109ff1,libderive_more-10c4e33026245ec1,liburl-184633b9c79ab0ce,libidna-2eb1fb52f110159e,libidna_adapter-ee949d5f6ff39d57,libicu_properties-f377ce9aa238cd9c,libicu_properties_data-7931cf8a5dfdba74,libicu_normalizer-1ba3a433e7dc2241,libicu_normalizer_data-de2ccdb037cb6b3c,libicu_collections-299efef37ebf6421,libutf8_iter-8667528961b1857c,libpotential_utf-1fdbd22bc926b6ff,libicu_provider-ed6e031c9f108f07,libicu_locale_core-31e14abb28b75f4c,libtinystr-84a0553a0c094d40,liblitemap-405ce459934fb283,libwriteable-117a37e0863563eb,libzerovec-4ab20b9e3dc34e1d,libzerotrie-2da7be6347e67321,libyoke-2de3e3216a39c9ff,libstable_deref_trait-0e096ff5984b49fc,libzerofrom-af390e71bb95f5c2,libform_urlencoded-75eb2c5d40dbe775,libpercent_encoding-0aff148551bb810a,libed25519_dalek-9a9ee834e9be032c,libsha2-8cace948ae2e6d5f,libed25519-d51a67850575cb9b,libsignature-9671803ce5af0bab,libpkcs8-a1169071690f84d6,libspki-42bd612f542cd5bb,libder-18fe80a7689add1f,libpem_rfc7468-7623dc0ce520a633,libbase64ct-fd7b472ffe3384a9,libdata_encoding_macro-0e54f4c49fccfbf5,libcurve25519_dalek-c46dd87a36559eb7,libdigest-d565164163fe74d3,libconst_oid-a914ddb7b7344c42,libcrypto_common-a2e335e0df3a1e61,libblock_buffer-7cc5b76e81b90f24,libhybrid_array-891ddfc1e3340cc7,libn0_error-2009ee40cb58e819,libdata_encoding-78d18a20fed30b84,libspt_runtime-93f018036417cc71,libregex-4b3d8c0183b6a79f,libregex_automata-86cf6b44556a0444,libaho_corasick-2114ef6e31c299bf,libregex_syntax-43e21e70306c1292,libtoml-f17076c2fafda3bd,libtoml_edit-64fc598b636dff53,libserde_spanned-1f37eec570f37b5f,libwinnow-9060fa526873a459,libtoml_write-cbe0ee03e0822432,libtoml_datetime-452346770fb9ab3a,libschemars-3087fbf68ad7e654,libdyn_clone-2a79e79feefffffc,libref_cast-2a894f8d7459b2eb,libspt_store-4881353c2ae820ef,libuuid-04db0902594e461e,libgetrandom-6e46645e280c4350,librand_core-f5a4f9121bdf1050,libserde_json-17281f0e02bd2a5a,libmemchr-cb0a0fc22acd0836,libitoa-2fadb60393a045de,libzmij-b82215484eee4f22,libindexmap-041aae331fe12ea8,libequivalent-81775ab5d8154b89,libhashbrown-635befb600e68988,libfs2-509ec141a8cd0084,libwinapi-3ada3e42829efa8d,librusqlite-e6410a40587b2412,libbitflags-ac2f1c33302ac4cb,libsmallvec-0351b9b3b0d13bf4,libfallible_streaming_iterator-b9d1906a1096dee7,libfallible_iterator-ed130759af23d6c1,libhashlink-2da09f725f0306bc,libhashbrown-21e87604c4d20056,libahash-7f0b33588d29b971,libonce_cell-413813fe09b89788,libportable_atomic-64fa3d89ee64b215,libzerocopy-50fbb0b48fb600e7,liblibsqlite3_sys-abece50c6a4c2bc2,libspt_proto-db7dbc0885f8410f,libed25519_dalek-97fab2c71a4e1d4b,libsha2-8b10433dc072d985,libcurve25519_dalek-8acc79d327bfa0b2,libcpufeatures-c232fa689cff9078,libzeroize-43316c5fd3484d22,librand_core-d7ec264f3ecb092b,libgetrandom-6d5f68613080b1be,libcfg_if-4be1d57b9cd9afec,libdigest-c21bf9f154372849,libsubtle-3e3d27900247595c,libblock_buffer-7afe031c92b89e1c,libcrypto_common-38bd24d386ad0136,libgeneric_array-6efae25bedc163a0,libtypenum-5b38d9aafac5529f,libed25519-1557411f44961c05,libsignature-7f41cf5669168da2,libserde-2cfe227265f9e30b,libserde_core-3ddf51a30c07af59}.rlib" "<sysroot>\\lib\\rustlib\\x86_64-pc-windows-msvc\\lib/{libstd-*,libpanic_unwind-*,libcfg_if-*,libwindows_targets-*,librustc_demangle-*,libstd_detect-*,libhashbrown-*,librustc_std_workspace_alloc-*,libunwind-*,librustc_std_workspace_core-*,liballoc-*,libcore-*,libcompiler_builtins-*}.rlib" "kernel32.lib" "user32.lib" "userenv.lib" "advapi32.lib" "C:\\Users\\decid\\.cargo\\registry\\src\\index.crates.io-1949cf8c6b5b557f\\windows_x86_64_msvc-0.52.6\\lib\\windows.0.52.0.lib" "iphlpapi.lib" "legacy_stdio_definitions.lib" "advapi32.lib" "cfgmgr32.lib" "gdi32.lib" "kernel32.lib" "msimg32.lib" "opengl32.lib" "synchronization.lib" "user32.lib" "winspool.lib" "ws2_32.lib" "bcrypt.lib" "advapi32.lib" "kernel32.lib" "kernel32.lib" "kernel32.lib" "ntdll.lib" "userenv.lib" "ws2_32.lib" "dbghelp.lib" "/defaultlib:msvcrt" "/NXCOMPAT" "/LIBPATH:C:\\actions-runner\\_work\\spt-core\\spt-core\\target\\debug\\build\\libsqlite3-sys-dfb857ecd39841b9\\out" "/LIBPATH:C:\\actions-runner\\_work\\spt-core\\spt-core\\target\\debug\\build\\blake3-60c87a81e6cc6ba6\\out" "/LIBPATH:C:\\actions-runner\\_work\\spt-core\\spt-core\\target\\debug\\build\\aws-lc-sys-1a05d93e0719da20\\out" "/LIBPATH:C:\\actions-runner\\_work\\spt-core\\spt-core\\target\\debug\\build\\ring-9c61033a2441dbc4\\out" "/LIBPATH:C:\\Program Files\\Microsoft Visual Studio\\2022\\Community\\VC\\Tools\\MSVC\\14.44.35207\\atlmfc\\lib\\x64" "/LIBPATH:C:\\Users\\decid\\.cargo\\registry\\src\\index.crates.io-1949cf8c6b5b557f\\windows_x86_64_msvc-0.52.6\\lib" "/OUT:C:\\actions-runner\\_work\\spt-core\\spt-core\\target\\debug\\deps\\idempotent-95939bd2065f3fc8.exe" "/OPT:REF,NOICF" "/DEBUG" "/PDBALTPATH:%_PDB%" "/NATVIS:<sysroot>\\lib\\rustlib\\etc\\intrinsic.natvis" "/NATVIS:<sysroot>\\lib\\rustlib\\etc\\liballoc.natvis" "/NATVIS:<sysroot>\\lib\\rustlib\\etc\\libcore.natvis" "/NATVIS:<sysroot>\\lib\\rustlib\\etc\\libstd.natvis" "/NATVIS:C:\\Users\\decid\\AppData\\Local\\Temp\\rustcAarZLz\\idempotent-0.natvis" "/NATVIS:C:\\Users\\decid\\AppData\\Local\\Temp\\rustcAarZLz\\idempotent-1.natvis" "/NATVIS:C:\\Users\\decid\\AppData\\Local\\Temp\\rustcAarZLz\\idempotent-2.natvis"
2026-07-10T09:15:57.8035386Z   = note: some arguments are omitted. use `--verbose` to show all linker arguments
2026-07-10T09:15:57.8037007Z   = note:    Creating library C:\actions-runner\_work\spt-core\spt-core\target\debug\deps\idempotent-95939bd2065f3fc8.lib and object C:\actions-runner\_work\spt-core\spt-core\target\debug\deps\idempotent-95939bd2065f3fc8.exp␍
2026-07-10T09:15:57.8038636Z           LINK : fatal error LNK1201: error writing to program database 'C:\actions-runner\_work\spt-core\spt-core\target\debug\deps\idempotent-95939bd2065f3fc8.pdb'; check for insufficient disk space, invalid path, or insufficient privilege␍
2026-07-10T09:15:57.8039716Z           
2026-07-10T09:15:57.8039849Z 
2026-07-10T09:15:57.8209647Z error: could not compile `spt-daemon` (test "idempotent") due to 1 previous error
2026-07-10T09:16:02.5786029Z error: command `'C:\Users\decid\.rustup\toolchains\stable-x86_64-pc-windows-msvc\bin\cargo.exe' test --no-run --message-format json-render-diagnostics --workspace` exited with code 101
2026-07-10T09:16:02.6758521Z ##[error]Process completed with exit code 1.
